program: Orca
programVersion: 6.0.1
elementType: O O C O O C C C F F F F F F Co C H H H C N
charge: 0
multiplicity: 4
keywords: b3lyp d3bj def2-TZVPP def2/J RIJCOSX TightSCF defgrid3 CPCM(Acetonitrile)
formula: C6H3CoF6NO4
InChI: InChI=1/2C2F3O2.C2H3N.Co/c2*3-2(4,5)1(6)7;1-2-3;/h;;1H3;/q2*-2;;+4/rC6H3CoF6NO4/c1-2-14-7(15-3(16-7)5(8,9)10)17-4(18-7)6(11,12)13/h1H3
21 atoms
O  1.906496 1.755365 7.416285
O  2.164043 5.830395 7.265985
C  2.069139 5.680398 6.019517
O  2.354225 2.984242 9.201862
O  1.725932 4.576005 5.495887
C  2.32026 1.872934 8.610394
C  2.752684 0.598806 9.371215
C  2.331252 6.885162 5.087386
F  3.224055 -0.347957 8.534852
F  1.684582 0.078021 10.028451
F  3.70832 0.866389 10.284167
F  1.162327 7.531796 4.842612
F  3.183239 7.769232 5.643364
F  2.84329 6.496348 3.901648
Co 1.542901 3.778356 7.380882
C  -2.696064 4.557753 8.912656
H  -2.89755 3.918528 9.776571
H  -3.403959 4.327486 8.111318
H  -2.796189 5.608482 9.198849
C  -1.350507 4.317922 8.440368
N  -0.275021 4.127627 8.063031
elementType: O C F Co H N
totalener: -2568.02388586569487 hartree
nucrepener: 1807.64615924772306 hartree
electener: -4375.64362666433135 hartree
oneelecener: -7154.28289049979412 hartree
twoeener: 2778.63926383546277 hartree
cpcmener: -0.02641128720439 hartree
kineticenergy: 2561.42387550147077 hartree
exchangeener: -151.500680241382 hartree
correlationener: -7.138549275105 hartree
xcener: -158.639229516487 hartree
s2: 3.756056
energy: -7553.7057 -895.9781 -777.4118 -777.2695 -777.2490 -672.9961 -672.9956 -672.9947 -672.9937 -672.9886 -672.9866 -521.3115 -521.3087 -521.2233 -521.2228 -390.9432 -284.2808 -284.2791 -281.2881 -281.2855 -279.5378 -278.0920 -105.1245 -69.5159 -69.2891 -69.1930 -36.1637 -36.1626 -33.8630 -33.8629 -33.8151 -33.8130 -30.4826 -30.4208 -27.7382 -27.7296 -26.1769 -21.4538 -20.7034 -20.6739 -17.7944 -17.7430 -16.6720 -16.6705 -16.6507 -16.6483 -14.9495 -14.7479 -14.6169 -13.8360 -13.6408 -13.5309 -13.4502 -13.4245 -13.2548 -13.2323 -13.0173 -13.0160 -12.8846 -12.8308 -12.7844 -12.6327 -12.2926 -12.2908 -12.1276 -12.1204 -11.7609 -11.7596 -11.4440 -11.1987 -10.6771 -10.5680 -10.3189 -9.9509 -9.7365 -9.0813 -9.0387 -9.0305 -8.8649 -8.8057 -7.8272 -1.2578 -1.1145 -0.4445 -0.3163 0.1727 1.1053 2.2373 2.4845 2.7509 2.9326 3.0229 electronvolt
energy: -7553.6719 -894.2510 -775.9418 -775.8539 -775.8500 -672.9953 -672.9947 -672.9940 -672.9931 -672.9880 -672.9860 -521.2614 -521.2586 -521.1774 -521.1768 -390.9084 -284.2817 -284.2800 -281.2886 -281.2861 -279.5303 -278.0911 -101.1932 -65.2765 -65.1457 -65.1150 -36.1625 -36.1614 -33.8614 -33.8613 -33.8139 -33.8118 -30.3961 -30.3359 -27.6318 -27.6272 -26.1242 -21.4467 -20.6864 -20.6603 -17.7713 -17.7260 -16.6712 -16.6697 -16.6444 -16.6434 -14.7582 -14.6434 -14.5638 -13.5508 -13.4875 -13.4363 -13.4033 -13.2172 -13.1863 -13.1750 -12.9455 -12.8558 -12.7983 -12.7756 -12.6303 -12.5549 -12.2872 -12.2796 -12.0797 -12.0587 -11.7590 -11.7580 -10.3867 -10.3613 -9.9004 -9.4639 -9.2810 -9.1580 -8.9657 -8.8606 -8.1303 -7.8464 -3.0492 -2.4869 -1.9422 -1.0615 -1.0560 -0.2289 -0.2055 0.3283 1.1929 2.3175 2.4917 electronvolt
chargesum: -0.0000000
charge: -0.457448 -0.452602 0.352242 -0.454205 -0.458738 0.352042 0.508539 0.508075 -0.169629 -0.176507 -0.169817 -0.176663 -0.169479 -0.169853 0.839120 -0.114993 0.150974 0.152487 0.151783 0.048285 -0.093615
charge: 0.112113 0.112782 -0.498840 0.112177 0.111569 -0.498779 -0.601187 -0.601241 0.195128 0.182568 0.195054 0.182312 0.196006 0.194441 0.164923 0.054768 0.061185 0.062290 0.061796 0.003205 0.197731
qa: -0.4574 -0.4526 0.3522 -0.4542 -0.4587 0.3520 0.5085 0.5081 -0.1696 -0.1765 -0.1698 -0.1767 -0.1695 -0.1699 0.8391 -0.1150 0.1510 0.1525 0.1518 0.0483 -0.0936
va: 2.0228 2.0164 4.0152 2.0160 2.0226 4.0149 4.4757 4.4761 1.1372 1.1235 1.1370 1.1232 1.1379 1.1364 4.4969 3.8281 0.9873 0.9871 0.9871 3.6630 3.2226
dispersion: -0.031961081 hartree
energy: -2568.055846946667 hartree
dipole: -17.344168038 13.410100839 -3.934067198 3.016192314 -2.500715154 0.515477160 6.019690633 -4.901961596 1.117729036
dipolemethod: SCF
magnitude: 4.122125619 au
magnitude: 10.477610655 debye
