program: Orca
programVersion: 6.0.1
elementType: O O C O O C C C F F F F F F O H H Co C N C H H H
charge: 0
multiplicity: 4
keywords: b3lyp d3bj def2-TZVPP def2/J RIJCOSX TightSCF defgrid3 CPCM(Acetonitrile)
formula: C6H5CoF6NO5
InChI: InChI=1/2C2F3O2.C2H3N.Co.H2O/c2*3-2(4,5)1(6)7;1-2-3;;/h;;1H3;;1H2/q2*-1;;+2;/rC6H5CoF6NO5/c1-2-14-7(17,18-3(15)5(8,9)10)19-4(16)6(11,12)13/h17H2,1H3
24 atoms
O  1.014598 1.387868 8.53484
O  1.310183 2.184769 4.151163
C  2.54417 2.266323 4.121549
O  3.141344 2.116335 8.167859
O  3.351869 2.711573 5.012633
C  2.234788 1.410396 8.737337
C  2.826906 0.468429 9.828702
C  3.293952 1.776009 2.846237
F  3.727273 -0.390977 9.287448
F  1.875531 -0.266771 10.437192
F  3.470925 1.182008 10.786782
F  4.167348 0.782811 3.15042
F  2.448982 1.303737 1.908767
F  4.006263 2.786636 2.286364
O  0.722619 3.176333 6.566188
H  0.664328 2.749236 5.664053
H  0.557447 2.46365 7.247631
Co 2.70985 3.364109 6.733364
C  3.785862 6.198163 7.353042
N  3.385322 5.139627 7.117553
C  4.288236 7.520157 7.649394
H  3.45744 8.161861 7.956071
H  5.020942 7.453927 8.458679
H  4.763486 7.934508 6.755698
elementType: O C F H Co N
totalener: -2644.49197369124795 hartree
nucrepener: 1983.50866061011038 hartree
electener: -4627.96864669610113 hartree
oneelecener: -7611.15908146606853 hartree
twoeener: 2983.19043476996694 hartree
cpcmener: -0.03198624695410 hartree
kineticenergy: 2637.60325874442697 hartree
exchangeener: -158.628188367654 hartree
correlationener: -7.551885040514 hartree
xcener: -166.180073408168 hartree
s2: 3.756257
energy: -7553.4793 -895.8221 -777.2185 -777.1650 -777.0773 -672.8227 -672.8226 -672.8135 -672.8134 -672.8119 -672.8116 -521.4149 -521.1968 -521.1967 -520.7796 -520.7794 -391.0847 -283.9990 -283.9989 -281.0754 -281.0752 -279.6944 -278.1412 -104.9425 -69.2897 -69.1680 -68.9894 -35.9649 -35.9648 -33.6683 -33.6682 -33.6237 -33.6236 -29.9830 -29.9346 -28.3033 -27.6953 -27.6766 -26.3101 -21.5275 -20.3723 -20.3700 -17.5788 -17.5750 -16.4779 -16.4772 -16.4653 -16.4597 -15.4397 -15.1195 -14.9148 -14.8709 -13.7394 -13.6571 -13.3359 -13.2522 -13.2293 -13.1323 -13.1305 -12.9072 -12.9054 -12.7437 -12.6789 -12.6355 -12.3069 -12.2521 -12.1379 -12.1375 -11.9347 -11.8625 -11.5985 -11.5976 -11.3520 -11.1363 -10.5777 -10.4795 -10.3158 -9.7392 -9.6989 -9.6463 -8.9885 -8.6294 -8.4507 -8.3853 -8.2227 -8.1297 -0.8646 -0.8212 -0.5217 -0.4591 0.2563 1.1720 2.0968 2.4106 2.7558 3.0038 3.0361 electronvolt
energy: -7553.4432 -894.1156 -775.7770 -775.7389 -775.7059 -672.8215 -672.8213 -672.8133 -672.8132 -672.8118 -672.8114 -521.3577 -521.1385 -521.1383 -520.7776 -520.7774 -391.0625 -283.9949 -283.9948 -281.0746 -281.0743 -279.6794 -278.1407 -101.0618 -65.0748 -65.0416 -65.0335 -35.9631 -35.9630 -33.6662 -33.6661 -33.6233 -33.6232 -29.9288 -29.8810 -28.1827 -27.6245 -27.6077 -26.2581 -21.5187 -20.3513 -20.3488 -17.5455 -17.5417 -16.4759 -16.4752 -16.4559 -16.4528 -15.3731 -14.9485 -14.6881 -14.6720 -13.6711 -13.2670 -13.2356 -13.2233 -13.2029 -13.1019 -13.0662 -12.8770 -12.8729 -12.6824 -12.6014 -12.3628 -12.2034 -12.1449 -12.1261 -11.9320 -11.8215 -11.8024 -11.5966 -11.5958 -10.6364 -10.5104 -10.3725 -9.3835 -9.3471 -9.2816 -8.9091 -8.5224 -8.4417 -7.8094 -7.7101 -2.5741 -2.3966 -2.3308 -0.7095 -0.7080 -0.2096 -0.1650 0.3499 1.2060 2.1661 2.4688 electronvolt
chargesum: -0.0000000
charge: -0.430411 -0.430377 0.323508 -0.481380 -0.481346 0.323015 0.500456 0.500672 -0.181905 -0.175694 -0.181918 -0.181797 -0.175683 -0.182027 -0.430825 0.260152 0.259691 0.803598 0.088887 -0.072006 -0.114828 0.153666 0.153209 0.153345
charge: 0.090771 0.090870 -0.506211 0.111079 0.111022 -0.506351 -0.599882 -0.599880 0.175983 0.190201 0.175974 0.176143 0.190215 0.175837 0.375854 -0.128772 -0.129066 0.151482 0.013572 0.194647 0.057419 0.062938 0.063057 0.063097
qa: -0.4304 -0.4304 0.3235 -0.4814 -0.4813 0.3230 0.5005 0.5007 -0.1819 -0.1757 -0.1819 -0.1818 -0.1757 -0.1820 -0.4308 0.2602 0.2597 0.8036 0.0889 -0.0720 -0.1148 0.1537 0.1532 0.1533
va: 2.0590 2.0592 4.2127 1.9981 1.9985 4.2139 4.4527 4.4526 1.1139 1.1316 1.1139 1.1141 1.1317 1.1137 2.1304 1.0546 1.0554 4.5494 3.6035 3.2202 3.8270 0.9868 0.9869 0.9868
dispersion: -0.037285592 hartree
energy: -2644.529259282754 hartree
dipole: -1.689805632 3.105757416 1.415951784 19.591353919 -14.174832909 5.416521010 3.686917597 -2.553167814 1.133749782
dipolemethod: SCF
magnitude: 5.712180658 au
magnitude: 14.519209372 debye
