program: Orca
programVersion: 6.0.1
elementType: O O C O O C C C F F F F F F O H H Co C N C H H H C N C H H H
charge: 0
multiplicity: 4
keywords: b3lyp d3bj def2-TZVPP def2/J RIJCOSX TightSCF defgrid3 CPCM(Acetonitrile)
formula: C8H8CoF6N2O5
InChI: InChI=1/2C2F3O2.2C2H3N.Co.H2O/c2*3-2(4,5)1(6)7;2*1-2-3;;/h;;2*1H3;;1H2/q2*-1;;;+2;/rC8H8CoF6N2O5/c1-3-16-9(20,17-4-2,21-5(18)7(10,11)12)22-6(19)8(13,14)15/h20H2,1-2H3
30 atoms
O  0.961068 0.700959 7.337346
O  0.347035 4.679203 4.575692
C  1.169568 5.507119 4.994395
O  2.44389 2.123942 8.316547
O  1.869848 5.493133 6.06083
C  1.926276 0.991421 8.066962
C  2.648946 -0.176029 8.80857
C  1.439921 6.774612 4.125626
F  3.945771 -0.270471 8.40778
F  2.071541 -1.376289 8.585643
F  2.65843 0.025299 10.152525
F  2.725607 6.782564 3.679331
F  0.638229 6.844325 3.041681
F  1.256069 7.914934 4.8403
O  0.104374 3.144092 6.781629
H  0.012703 3.441808 5.840491
H  0.242936 2.153452 6.817084
Co 1.996425 3.814802 7.192604
C  3.370788 2.348804 4.693146
N  2.897943 2.869687 5.609693
C  3.960478 1.697329 3.542749
H  4.31904 2.454476 2.840335
H  4.7971 1.07376 3.869599
H  3.207012 1.071622 3.056403
C  1.903424 5.446491 9.896889
N  1.934387 4.828307 8.920986
C  1.863353 6.220035 11.119813
H  2.395077 5.680857 11.908537
H  2.339177 7.189975 10.951632
H  0.821652 6.370156 11.417081
elementType: O C F H Co N
totalener: -2777.23568317748777 hartree
nucrepener: 2448.92131466537421 hartree
electener: -5226.11668324066704 hartree
oneelecener: -8721.52870536728369 hartree
twoeener: 3495.41202212661710 hartree
cpcmener: -0.04031982522603 hartree
kineticenergy: 2769.67902982468286 hartree
exchangeener: -172.930331357901 hartree
correlationener: -8.416908772067 hartree
xcener: -181.347240129968 hartree
s2: 3.756388
energy: -7553.1604 -895.4695 -777.0069 -776.7313 -776.6594 -672.7129 -672.7045 -672.7021 -672.6987 -672.6896 -672.6891 -520.9381 -520.7051 -520.5969 -520.4318 -520.4209 -390.7146 -390.6074 -283.8174 -283.7957 -280.7311 -280.6860 -279.3075 -279.2166 -278.0191 -277.9881 -104.6046 -69.2186 -68.6745 -68.5304 -35.8270 -35.8100 -33.5376 -33.5205 -33.4957 -33.4808 -29.5818 -29.5253 -27.8478 -27.3042 -27.2480 -25.9622 -25.8810 -21.3442 -21.3053 -20.1713 -20.1469 -17.3595 -17.3356 -16.3467 -16.3307 -16.3198 -16.3034 -15.1303 -14.9238 -14.4900 -14.4037 -14.2999 -13.4678 -13.3605 -13.1272 -13.1157 -13.0516 -13.0138 -12.8599 -12.8374 -12.7648 -12.7234 -12.6862 -12.6610 -12.4278 -12.3147 -12.1413 -12.0571 -12.0287 -12.0020 -11.9779 -11.7611 -11.6025 -11.4968 -11.4807 -11.0819 -10.6625 -10.2970 -10.1355 -10.1229 -10.0515 -9.9729 -9.2583 -9.0648 -8.6586 -8.5742 -8.3501 -8.3253 -8.1856 -8.0166 -7.2901 -0.6584 -0.5327 -0.3152 -0.1787 -0.0381 0.0895 0.4475 0.9550 1.7598 2.0981 2.5142 electronvolt
energy: -7553.1270 -893.7303 -775.4642 -775.3147 -775.3047 -672.7118 -672.7046 -672.7018 -672.6976 -672.6898 -672.6889 -520.8814 -520.6491 -520.5450 -520.4289 -520.4179 -390.6860 -390.5792 -283.8138 -283.7921 -280.7314 -280.6872 -279.2994 -279.2096 -278.0183 -277.9874 -100.6533 -64.7414 -64.6202 -64.5439 -35.8255 -35.8086 -33.5359 -33.5188 -33.4953 -33.4806 -29.5346 -29.4827 -27.7311 -27.2412 -27.1897 -25.9179 -25.8410 -21.3378 -21.2996 -20.1542 -20.1310 -17.3333 -17.3107 -16.3450 -16.3292 -16.3145 -16.2984 -15.0819 -14.7437 -14.3865 -14.2758 -14.2006 -13.3807 -13.1223 -13.1044 -13.0529 -13.0371 -12.8141 -12.8072 -12.7321 -12.7053 -12.6745 -12.6629 -12.6056 -12.3919 -12.2675 -12.0612 -12.0244 -11.9988 -11.9578 -11.6693 -11.5676 -11.4928 -11.4813 -11.3868 -10.2919 -10.1571 -10.1363 -10.0110 -9.7341 -8.9833 -8.6524 -8.5747 -8.4621 -8.1997 -8.0787 -7.4473 -7.3761 -2.6922 -2.1333 -1.0694 -0.5086 -0.3947 -0.1387 -0.0566 0.1352 0.2376 0.5228 0.9572 electronvolt
chargesum: 0.0000000
charge: -0.462116 -0.461436 0.317840 -0.488106 -0.488307 0.311497 0.505718 0.501549 -0.188943 -0.181771 -0.187282 -0.188652 -0.181026 -0.186067 -0.482963 0.254005 0.251131 0.776456 0.016374 -0.081128 -0.124840 0.148606 0.148814 0.149815 0.044816 -0.053117 -0.119940 0.149584 0.149526 0.149965
charge: 0.067574 0.061783 -0.531382 0.100404 0.101560 -0.533418 -0.595642 -0.596204 0.166882 0.181571 0.169109 0.166935 0.182744 0.170553 0.372785 -0.132430 -0.144666 -0.018900 -0.020790 0.192268 0.049186 0.058882 0.059573 0.059442 -0.012418 0.194670 0.050417 0.059562 0.059604 0.060345
qa: -0.4621 -0.4614 0.3178 -0.4881 -0.4883 0.3115 0.5057 0.5015 -0.1889 -0.1818 -0.1873 -0.1887 -0.1810 -0.1861 -0.4830 0.2540 0.2511 0.7765 0.0164 -0.0811 -0.1248 0.1486 0.1488 0.1498 0.0448 -0.0531 -0.1199 0.1496 0.1495 0.1500
va: 2.0249 2.0199 4.2069 1.9616 1.9778 4.2162 4.4459 4.4557 1.1024 1.1216 1.1057 1.1027 1.1232 1.1075 2.0446 1.0453 1.0668 4.5858 3.7215 3.1492 3.8264 0.9875 0.9874 0.9873 3.6508 3.1748 3.8264 0.9873 0.9875 0.9871
dispersion: -0.050109366 hartree
energy: -2777.285792543562 hartree
dipole: 0.741754043 1.438358579 2.180112622 0.862669869 0.275284143 1.137954012 2.240855504 -1.118163826 1.122691678
dipolemethod: SCF
magnitude: 2.703380658 au
magnitude: 6.871447549 debye
