program: Orca
programVersion: 6.0.1
elementType: O O C O O C C C F F F F F F O H H Co C N C H H H C N C H H H
charge: 0
multiplicity: 4
keywords: TPSS D3BJ TightOpt Freq def2-TZVPP def2/J RIJCOSX TightSCF defgrid3 CPCM(Acetonitrile)
frequency: 0.00 0.00 0.00 0.00 0.00 0.00 12.68 16.27 19.85 21.53 23.79 25.96 27.23 30.54 42.88 44.51 49.64 83.18 91.98 108.08 111.77 127.81 148.74 164.40 172.42 188.91 192.06 211.85 238.67 243.75 258.05 260.06 267.08 303.30 307.54 327.88 396.81 399.57 402.44 404.65 406.45 409.92 466.15 473.23 492.29 493.98 560.88 583.46 584.35 688.81 691.74 733.15 769.02 769.19 792.10 819.93 883.35 941.36 942.94 1036.07 1036.69 1037.61 1037.91 1050.62 1050.73 1096.90 1097.10 1143.50 1148.89 1363.78 1365.82 1379.98 1380.66 1432.45 1432.87 1433.58 1434.31 1515.84 1624.41 1649.82 2312.71 2314.48 3018.88 3019.64 3096.58 3097.87 3097.95 3098.55 3338.80 3398.70
frequency: 12.68 16.27 19.85 21.53 23.79 25.96 27.23 30.54 42.88 44.51 49.64 83.18 91.98 108.08 111.77 127.81 148.74 164.40 172.42 188.91 192.06 211.85 238.67 243.75 258.05 260.06 267.08 303.30 307.54 327.88 396.81 399.57 402.44 404.65 406.45 409.92 466.15 473.23 492.29 493.98 560.88 583.46 584.35 688.81 691.74 733.15 769.02 769.19 792.10 819.93 883.35 941.36 942.94 1036.07 1036.69 1037.61 1037.91 1050.62 1050.73 1096.90 1097.10 1143.50 1148.89 1363.78 1365.82 1379.98 1380.66 1432.45 1432.87 1433.58 1434.31 1515.84 1624.41 1649.82 2312.71 2314.48 3018.88 3019.64 3096.58 3097.87 3097.95 3098.55 3338.80 3398.70
formula: C8H8CoF6N2O5
InChI: InChI=1/2C2F3O2.2C2H3N.Co.H2O/c2*3-2(4,5)1(6)7;2*1-2-3;;/h;;2*1H3;;1H2/q2*-1;;;+2;/rC8H8CoF6N2O5/c1-3-16-9(20,17-4-2,21-5(18)7(10,11)12)22-6(19)8(13,14)15/h20H2,1-2H3
30 atoms
O  1.477247 0.883211 7.466043
O  0.349488 4.820022 4.436048
C  1.0920 5.686861 4.914054
O  2.780156 2.598497 8.208411
O  1.914334 5.613227 5.889978
C  2.3176 1.406862 8.208353
C  2.951955 0.53373 9.335943
C  1.071747 7.110441 4.274285
F  4.295479 0.417839 9.159932
F  2.441276 -0.715094 9.373423
F  2.753316 1.09084 10.559148
F  2.298819 7.443711 3.792514
F  0.197386 7.205971 3.250542
F  0.729551 8.054165 5.190345
O  0.56967 3.257614 6.608653
H  0.307626 3.526649 5.695189
H  0.667099 2.275837 6.659258
Co 2.605818 3.908167 6.696067
C  3.293147 2.162837 4.166284
N  3.051958 2.807021 5.094996
C  3.593983 1.355347 3.002974
H  3.821748 2.009788 2.15703
H  4.457934 0.719999 3.216448
H  2.729814 0.730803 2.760821
C  5.34717 5.311612 7.445028
N  4.351231 4.790235 7.177214
C  6.594511 5.966733 7.777638
H  6.800893 5.83468 8.843265
H  7.403981 5.525004 7.190001
H  6.515077 7.033058 7.548871
totalener: -2778.10484553092238 hartree
nucrepener: 2456.80340420633502 hartree
electener: -5236.92804819305366 hartree
oneelecener: -8737.28317584659271 hartree
twoeener: 3500.35512765353906 hartree
cpcmener: -0.03829481852991 hartree
kineticenergy: 2770.75014169935821 hartree
exchangeener: -218.759678415194 hartree
correlationener: -6.859681071244 hartree
xcener: -225.619359486438 hartree
s2: 3.757185
dispersion: -0.037490072 hartree
s2: 3.757053
dispersion: -0.037410314 hartree
s2: 3.756690
dispersion: -0.037030782 hartree
s2: 3.756484
dispersion: -0.037029787 hartree
s2: 3.756351
dispersion: -0.036914130 hartree
s2: 3.756380
dispersion: -0.036996616 hartree
s2: 3.756442
dispersion: -0.037047696 hartree
s2: 3.756522
dispersion: -0.037130402 hartree
s2: 3.756575
dispersion: -0.037159252 hartree
s2: 3.756621
dispersion: -0.037172217 hartree
s2: 3.756644
dispersion: -0.037167775 hartree
s2: 3.756680
dispersion: -0.037150290 hartree
s2: 3.756708
dispersion: -0.037121093 hartree
s2: 3.756721
dispersion: -0.037067359 hartree
s2: 3.756717
dispersion: -0.037023961 hartree
s2: 3.756673
dispersion: -0.036980223 hartree
s2: 3.756640
dispersion: -0.036967441 hartree
s2: 3.756603
dispersion: -0.036951534 hartree
s2: 3.756569
dispersion: -0.036937617 hartree
s2: 3.756552
dispersion: -0.036927541 hartree
s2: 3.756546
dispersion: -0.036922844 hartree
s2: 3.756548
dispersion: -0.036920591 hartree
s2: 3.756551
dispersion: -0.036919084 hartree
s2: 3.756554
dispersion: -0.036917897 hartree
s2: 3.756556
dispersion: -0.036914872 hartree
s2: 3.756555
dispersion: -0.036915011 hartree
dispersion: -0.036914804 hartree
s2: 3.756553
dispersion: -0.036914600 hartree
dispersion: -0.036915196 hartree
dispersion: -0.036915898 hartree
dispersion: -0.036916012 hartree
dispersion: -0.036916260 hartree
dispersion: -0.036918381 hartree
dispersion: -0.036916821 hartree
elementType: O C F H Co N
energy: -7529.5636 -884.5491 -766.4374 -766.4021 -766.0825 -665.2276 -665.2274 -665.2112 -665.2109 -665.2108 -665.2102 -514.2619 -514.2571 -514.2254 -513.8726 -513.8692 -384.8422 -384.8245 -278.4697 -278.4680 -275.4412 -275.4377 -273.9975 -273.9596 -273.0537 -273.0404 -100.3523 -65.2798 -65.1893 -64.5626 -33.5718 -33.5712 -31.3635 -31.3633 -31.3195 -31.3188 -27.6975 -27.6522 -25.9227 -25.5059 -25.5022 -24.1421 -24.1119 -19.8542 -19.8348 -18.5042 -18.5020 -15.7627 -15.7593 -14.7398 -14.7390 -14.7116 -14.7089 -13.6606 -13.5762 -13.3403 -13.0581 -12.9836 -12.0334 -11.8312 -11.6662 -11.6338 -11.6239 -11.6236 -11.5875 -11.5673 -11.4603 -11.4531 -11.3394 -11.3253 -11.0513 -11.0426 -10.6028 -10.4846 -10.3657 -10.3628 -10.2172 -10.1737 -10.0500 -9.8214 -9.8209 -9.4637 -9.3433 -9.1616 -9.1305 -8.6372 -8.4982 -8.4391 -7.6637 -7.5956 -7.0603 -7.0118 -6.9557 -6.9251 -6.6392 -6.6177 -5.7028 -1.3840 -1.3814 -0.9800 -0.9658 -0.7760 -0.7321 0.1354 0.7537 1.1871 1.9073 2.1452 electronvolt
energy: -7529.5428 -883.2232 -765.2945 -765.2885 -765.1053 -665.2259 -665.2257 -665.2108 -665.2107 -665.2106 -665.2098 -514.1976 -514.1929 -514.1716 -513.8631 -513.8597 -384.8033 -384.7966 -278.4657 -278.4640 -275.4403 -275.4368 -273.9882 -273.9546 -273.0526 -273.0387 -97.0921 -61.8713 -61.7712 -61.6535 -33.5699 -33.5693 -31.3613 -31.3610 -31.3188 -31.3181 -27.6419 -27.5980 -25.8310 -25.4360 -25.4327 -24.1011 -24.0694 -19.8479 -19.8282 -18.4863 -18.4841 -15.7399 -15.7331 -14.7370 -14.7362 -14.7053 -14.7039 -13.6280 -13.4926 -13.2491 -12.9524 -12.9217 -11.9584 -11.6471 -11.6186 -11.6135 -11.6032 -11.5685 -11.5126 -11.4413 -11.4354 -11.3341 -11.3132 -11.2622 -11.0049 -10.9969 -10.5438 -10.4528 -10.3602 -10.3545 -10.1638 -10.1418 -9.9177 -9.8200 -9.8193 -9.3275 -9.1195 -9.0851 -9.0250 -8.2609 -7.8885 -7.6125 -7.4978 -7.3737 -6.9531 -6.8502 -5.7903 -5.7194 -4.1565 -3.2834 -2.6425 -1.2677 -1.2289 -0.8403 -0.8230 -0.7007 -0.6641 0.2019 0.7611 electronvolt
chargesum: -0.0000000
charge: -0.426341 -0.426367 0.296023 -0.454236 -0.454744 0.296189 0.410881 0.410729 -0.158775 -0.151753 -0.157398 -0.158698 -0.151828 -0.157612 -0.413893 0.247783 0.247716 0.633837 -0.101927 0.038643 -0.023948 0.117700 0.117597 0.117712 -0.093983 0.062205 -0.019642 0.118200 0.117733 0.118197
charge: 0.079448 0.079009 -0.542788 0.127603 0.127308 -0.542415 -0.625736 -0.625803 0.178610 0.193625 0.180503 0.178786 0.193601 0.180117 0.382654 -0.139044 -0.139519 -0.088643 -0.027494 0.204363 0.055066 0.056914 0.056711 0.056350 -0.025870 0.199741 0.055921 0.057006 0.056872 0.057104
qa: -0.4263 -0.4264 0.2960 -0.4542 -0.4547 0.2962 0.4109 0.4107 -0.1588 -0.1518 -0.1574 -0.1587 -0.1518 -0.1576 -0.4139 0.2478 0.2477 0.6338 -0.1019 0.0386 -0.0239 0.1177 0.1176 0.1177 -0.0940 0.0622 -0.0196 0.1182 0.1177 0.1182
va: 2.0715 2.0716 4.2252 2.0365 2.0354 4.2245 4.5418 4.5417 1.1429 1.1644 1.1458 1.1431 1.1643 1.1454 2.0668 1.0472 1.0475 4.7864 3.7900 3.1203 3.9099 1.0034 1.0033 1.0034 3.7685 3.1166 3.9102 1.0036 1.0034 1.0036
dispersion: -0.036916431 hartree
energy: -2778.145960199606 hartree
dipole: 13.467332431 -8.483712298 4.983620132 -3.898725484 3.933651784 0.034926300 -10.467776675 8.577114405 -1.890662270
dipolemethod: SCF
magnitude: 5.330318311 au
magnitude: 13.548592421 debye
temp: 298.15 k
press: 1.00 atm
zeropoint: 0.17034291 hartree
thermalvibcorrection: 0.02497920 hartree
thermalrotcorrection: 0.00141627 hartree
thermaltrasncorrection: 0.00141627 hartree
thermaltotal: -2777.94780555 hartree
thermalcorr: 0.02781174 hartree
nonthermalcorr: 0.17034291 hartree
totalcorr: 0.19815465 hartree
thermalcorrenthalpy: 0.00094421 hartree
totalenthalpy: -2777.94686134 hartree
vibrat: 0.04818220 hartree
rotat: 0.01683390 hartree
transl: 0.02078077 hartree
total: 0.08710578 hartree
totalentropycorr: -0.08710578 hartree
gibbsenthalpy: -2778.03396712 hartree
gibbsminuselec: 0.11199308 hartree
