program: Orca
programVersion: 6.0.1
elementType: O O C O O C C C F F F F F F O H H Co C N C H H H C N C H H H
charge: 0
multiplicity: 4
keywords: b3lyp d3bj def2-TZVPP def2/J RIJCOSX TightSCF defgrid3 CPCM(Acetonitrile)
formula: C8H8CoF6N2O5
InChI: InChI=1/2C2F3O2.2C2H3N.Co.H2O/c2*3-2(4,5)1(6)7;2*1-2-3;;/h;;2*1H3;;1H2/q2*-1;;;+2;/rC8H8CoF6N2O5/c1-3-16-9(20,17-4-2,21-5(18)7(10,11)12)22-6(19)8(13,14)15/h20H2,1-2H3
30 atoms
O  0.536402 1.069802 8.178098
O  1.602149 2.510223 4.343197
C  2.806785 2.530994 4.65818
O  2.646327 1.911285 8.295976
O  3.356066 2.916893 5.733386
C  1.735019 1.058251 8.516104
C  2.238839 -0.157885 9.353495
C  3.840391 2.029274 3.60235
F  3.311511 -0.750295 8.767271
F  1.293413 -1.107795 9.517723
F  2.629644 0.242646 10.594095
F  4.606115 1.025097 4.103909
F  3.255687 1.566295 2.476698
F  4.683309 3.032742 3.237011
O  0.515446 3.238483 6.652455
H  0.727193 2.949491 5.714688
H  0.323336 2.400526 7.1715
Co 2.353901 3.72083 7.347386
C  2.937607 6.549577 6.012718
N  2.735319 5.526182 6.510085
C  3.191656 7.829689 5.386207
H  3.41354 8.574343 6.155381
H  4.043047 7.73732 4.706323
H  2.306182 8.137289 4.822976
C  1.743182 4.874607 10.249142
N  1.987884 4.469729 9.194714
C  1.435476 5.378859 11.570764
H  1.133489 4.548594 12.214866
H  2.321958 5.86392 11.988756
H  0.620896 6.104934 11.500636
elementType: O C F H Co N
totalener: -2777.23746201580980 hartree
nucrepener: 2456.96642185335577 hartree
electener: -5234.15415229152313 hartree
oneelecener: -8738.37209774399889 hartree
twoeener: 3504.21794545247576 hartree
cpcmener: -0.04973674341673 hartree
kineticenergy: 2769.67677612215766 hartree
exchangeener: -172.932999060946 hartree
correlationener: -8.416862144106 hartree
xcener: -181.349861205052 hartree
s2: 3.756888
energy: -7553.2022 -895.5120 -777.0458 -776.7664 -776.7130 -672.6958 -672.6955 -672.6852 -672.6851 -672.6848 -672.6847 -520.8891 -520.6277 -520.6269 -520.4043 -520.4039 -390.6935 -390.6929 -283.7965 -283.7964 -280.6992 -280.6983 -279.2877 -279.2862 -278.0179 -278.0172 -104.6419 -69.2420 -68.6955 -68.5966 -35.8084 -35.8081 -33.5188 -33.5186 -33.4776 -33.4770 -29.5958 -29.5169 -27.8008 -27.2617 -27.2516 -25.9694 -25.9205 -21.3443 -21.3347 -20.1536 -20.1455 -17.3456 -17.3342 -16.3282 -16.3269 -16.3033 -16.3018 -14.9345 -14.9152 -14.5368 -14.4201 -14.2922 -13.5048 -13.2210 -13.1729 -13.0923 -13.0883 -13.0286 -12.9590 -12.8435 -12.7691 -12.7288 -12.7033 -12.6564 -12.5057 -12.3282 -12.2555 -12.0486 -12.0208 -11.9991 -11.9360 -11.7266 -11.5641 -11.4801 -11.4708 -11.1974 -10.6619 -10.3174 -10.2366 -9.9949 -9.9733 -9.6135 -9.4593 -9.2081 -9.1773 -8.4078 -8.3351 -8.1023 -8.0470 -8.0359 -7.3378 -0.5967 -0.4641 -0.4487 -0.2361 0.0003 0.1620 0.4067 1.0695 1.5886 2.0876 2.6522 electronvolt
energy: -7553.1686 -893.7706 -775.5065 -775.3641 -775.3345 -672.6948 -672.6944 -672.6853 -672.6851 -672.6848 -672.6847 -520.8261 -520.5768 -520.5760 -520.4044 -520.4042 -390.6605 -390.6598 -283.7931 -283.7931 -280.7002 -280.6993 -279.2799 -279.2785 -278.0171 -278.0164 -100.6873 -64.7832 -64.6307 -64.5914 -35.8071 -35.8068 -33.5172 -33.5170 -33.4775 -33.4769 -29.5541 -29.4771 -27.6754 -27.2087 -27.1948 -25.9231 -25.8736 -21.3379 -21.3279 -20.1385 -20.1299 -17.3212 -17.3100 -16.3270 -16.3258 -16.2983 -16.2965 -14.8937 -14.7708 -14.3778 -14.3411 -14.1558 -13.4430 -13.1107 -13.0903 -13.0428 -13.0265 -12.8527 -12.7982 -12.7333 -12.7068 -12.6921 -12.6462 -12.4892 -12.4448 -12.2880 -12.1365 -12.0130 -12.0085 -11.9138 -11.7347 -11.5444 -11.4847 -11.4667 -11.4398 -10.3644 -10.1616 -10.1247 -9.9252 -9.9135 -8.9051 -8.6429 -8.5424 -8.3189 -8.2173 -8.1364 -7.5324 -7.3231 -2.6768 -2.2002 -0.9810 -0.5013 -0.4270 -0.1028 -0.0114 0.0642 0.1910 0.4672 1.0715 electronvolt
chargesum: -0.0000000
charge: -0.460123 -0.460012 0.299984 -0.470116 -0.470042 0.301452 0.504746 0.504452 -0.186553 -0.181368 -0.189510 -0.186866 -0.181509 -0.189059 -0.465591 0.247539 0.248324 0.748028 0.033898 -0.067367 -0.120522 0.148894 0.149594 0.150017 0.032196 -0.068525 -0.120759 0.149668 0.149624 0.149504
charge: 0.067091 0.066429 -0.532728 0.109147 0.109314 -0.532782 -0.595723 -0.595747 0.170205 0.182120 0.166434 0.169719 0.181927 0.167034 0.358340 -0.147393 -0.147675 -0.011294 -0.015016 0.193903 0.049956 0.059180 0.059591 0.060142 -0.015106 0.194068 0.049945 0.059321 0.059921 0.059675
qa: -0.4601 -0.4600 0.3000 -0.4701 -0.4700 0.3015 0.5047 0.5045 -0.1866 -0.1814 -0.1895 -0.1869 -0.1815 -0.1891 -0.4656 0.2475 0.2483 0.7480 0.0339 -0.0674 -0.1205 0.1489 0.1496 0.1500 0.0322 -0.0685 -0.1208 0.1497 0.1496 0.1495
va: 2.0251 2.0253 4.2425 1.9659 1.9657 4.2389 4.4519 4.4508 1.1064 1.1224 1.1020 1.1058 1.1222 1.1028 2.0719 1.0729 1.0721 4.6527 3.6770 3.1852 3.8259 0.9873 0.9873 0.9873 3.6804 3.1860 3.8260 0.9874 0.9873 0.9875
dispersion: -0.049291025 hartree
energy: -2777.286753040847 hartree
dipole: -8.535840857 8.700765248 0.164924391 29.713204088 -22.104127738 7.609076350 9.215928401 -6.203354268 3.012574133
dipolemethod: SCF
magnitude: 8.185404441 au
magnitude: 20.805644637 debye
