program: Orca
programVersion: 6.0.1
elementType: O O C O O C C C F F F F F F O H H Co C N C H H H C N C H H H C N C H H H
charge: 0
multiplicity: 4
keywords: b3lyp d3bj def2-TZVPP def2/J RIJCOSX TightSCF defgrid3 CPCM(Acetonitrile)
formula: C10H11CoF6N3O5
InChI: InChI=1/2C2F3O2.3C2H3N.Co.H2O/c2*3-2(4,5)1(6)7;3*1-2-3;;/h;;3*1H3;;1H2/q2*-1;;;;+2;/rC10H11CoF6N3O5/c1-4-18-11(23,19-5-2,20-6-3,24-7(21)9(12,13)14)25-8(22)10(15,16)17/h23H2,1-3H3
36 atoms
O  1.27732 0.999129 8.71177
O  0.640343 1.694434 4.407056
C  1.830878 2.028303 4.248755
O  3.034748 2.198321 7.898618
O  2.603119 2.680973 5.00889
C  2.479943 1.309911 8.608092
C  3.504329 0.504987 9.469785
C  2.518511 1.60934 2.910405
F  4.440837 -0.097343 8.688408
F  2.924139 -0.462136 10.215043
F  4.169502 1.327426 10.326998
F  3.678492 0.936906 3.133228
F  1.739109 0.817417 2.140447
F  2.830803 2.708567 2.168224
O  0.224322 2.620193 6.873362
H  0.22014 2.173995 5.979827
H  0.450646 1.922273 7.550753
Co 2.0422 3.68046 6.777466
C  4.877097 5.238418 6.613934
N  3.872837 4.669455 6.668884
C  6.137769 5.950546 6.545968
H  6.785629 5.623735 7.363653
H  6.62302 5.742288 5.588674
H  5.952299 7.024498 6.634361
C  1.26399 5.025808 9.611988
N  1.534105 4.577639 8.581557
C  0.926348 5.583148 10.906727
H  0.83115 4.773248 11.635181
H  1.716708 6.26814 11.225281
H  -0.020966 6.124252 10.836497
C  0.557166 5.820031 4.862154
N  1.085264 5.079072 5.574693
C  -0.10581 6.746111 3.96556
H  0.623321 7.15887 3.263298
H  -0.886599 6.217141 3.412177
H  -0.555542 7.556673 4.545197
elementType: O C F H Co N
totalener: -2909.99165027442041 hartree
nucrepener: 2955.56694512105696 hartree
electener: -5865.49527494882750 hartree
oneelecener: -9915.68266185160974 hartree
twoeener: 4050.18738690278269 hartree
cpcmener: -0.06332568263841 hartree
kineticenergy: 2901.76381990325854 hartree
exchangeener: -187.233744268964 hartree
correlationener: -9.281028820232 hartree
xcener: -196.514773089196 hartree
s2: 3.757662
energy: -7552.7578 -895.0497 -776.6558 -776.2693 -776.2066 -672.6276 -672.6274 -672.6201 -672.6199 -672.6193 -672.6191 -520.4124 -520.3632 -520.3628 -520.2266 -520.2252 -390.4263 -390.4257 -390.4139 -283.6930 -283.6928 -280.5083 -280.5079 -278.9916 -278.9909 -278.9904 -277.9274 -277.9272 -277.9272 -104.1956 -68.9612 -68.1773 -68.0524 -35.7276 -35.7273 -33.4407 -33.4398 -33.4033 -33.4029 -29.3657 -29.3066 -27.4023 -27.0643 -27.0155 -25.7243 -25.6683 -25.6580 -21.2111 -21.1993 -21.1986 -20.0364 -20.0325 -17.2124 -17.2092 -16.2510 -16.2503 -16.2204 -16.2193 -14.7420 -14.6595 -14.3034 -14.2978 -14.1433 -14.0427 -13.3245 -13.0334 -13.0225 -12.9763 -12.9605 -12.8205 -12.8173 -12.7170 -12.6754 -12.6274 -12.6033 -12.5924 -12.5609 -12.5399 -12.4839 -12.3022 -12.2248 -12.0369 -11.9432 -11.9344 -11.8250 -11.6278 -11.4656 -11.4236 -11.3984 -11.3741 -10.6893 -10.2602 -10.2481 -9.9741 -9.8014 -9.6934 -9.6924 -9.5276 -9.3659 -8.8799 -8.7935 -8.7489 -8.1782 -8.1640 -7.9550 -7.8612 -7.3695 -7.2226 -0.4003 -0.3493 -0.2054 -0.0012 0.0236 0.2634 0.2722 0.4098 0.4781 1.0766 1.1391 electronvolt
energy: -7552.7254 -893.2739 -775.0341 -774.8598 -774.8345 -672.6265 -672.6262 -672.6203 -672.6201 -672.6191 -672.6189 -520.3587 -520.3174 -520.3171 -520.2257 -520.2244 -390.3880 -390.3874 -390.3783 -283.6896 -283.6894 -280.5085 -280.5080 -278.9876 -278.9869 -278.9853 -277.9265 -277.9262 -277.9261 -100.1714 -64.2232 -64.1146 -64.1126 -35.7263 -35.7259 -33.4392 -33.4382 -33.4032 -33.4027 -29.3303 -29.2724 -27.3085 -27.0172 -26.9592 -25.6803 -25.6236 -25.6140 -21.2057 -21.1936 -21.1928 -20.0223 -20.0182 -17.1907 -17.1875 -16.2498 -16.2491 -16.2160 -16.2144 -14.6479 -14.6176 -14.2271 -14.1855 -14.0661 -13.9200 -13.2697 -13.0273 -13.0195 -12.9648 -12.9574 -12.6633 -12.6483 -12.6166 -12.5980 -12.5889 -12.5626 -12.5083 -12.4761 -12.2706 -12.2685 -12.1154 -12.0511 -11.9781 -11.9357 -11.9048 -11.8045 -11.5492 -11.4470 -11.4148 -11.3822 -10.9558 -10.0888 -10.0830 -9.9943 -9.7312 -9.6838 -9.6608 -9.4578 -8.5393 -8.4497 -8.3178 -8.1675 -7.9888 -7.8739 -7.0091 -6.9729 -2.4547 -0.8187 -0.7628 -0.3084 -0.2470 0.1080 0.1110 0.1828 0.3059 0.3101 0.4310 electronvolt
chargesum: 0.0000000
charge: -0.470702 -0.470730 0.278870 -0.482941 -0.482695 0.279715 0.504946 0.505059 -0.190386 -0.184411 -0.191876 -0.189466 -0.184460 -0.192819 -0.479845 0.242832 0.242654 0.829012 -0.008887 -0.094794 -0.124092 0.146655 0.146585 0.146310 -0.009073 -0.092407 -0.125199 0.146967 0.146116 0.146091 -0.008573 -0.092385 -0.125669 0.146344 0.147232 0.146021
charge: 0.053512 0.053577 -0.544658 0.108034 0.108069 -0.544593 -0.593529 -0.593503 0.165351 0.177561 0.163338 0.166753 0.177480 0.161989 0.343839 -0.158690 -0.158655 -0.221185 -0.036492 0.197887 0.044294 0.057049 0.057153 0.057401 -0.035432 0.198493 0.044341 0.057607 0.057168 0.056852 -0.035435 0.198384 0.044336 0.056933 0.057692 0.057075
qa: -0.4707 -0.4707 0.2789 -0.4829 -0.4827 0.2797 0.5049 0.5051 -0.1904 -0.1844 -0.1919 -0.1895 -0.1845 -0.1928 -0.4798 0.2428 0.2427 0.8290 -0.0089 -0.0948 -0.1241 0.1467 0.1466 0.1463 -0.0091 -0.0924 -0.1252 0.1470 0.1461 0.1461 -0.0086 -0.0924 -0.1257 0.1463 0.1472 0.1460
va: 2.0089 2.0093 4.2605 1.9393 1.9387 4.2590 4.4530 4.4523 1.1002 1.1175 1.0971 1.1019 1.1173 1.0954 2.0300 1.0729 1.0731 4.5735 3.7224 3.1048 3.8291 0.9877 0.9878 0.9877 3.7271 3.1537 3.8279 0.9879 0.9876 0.9876 3.7264 3.1533 3.8276 0.9876 0.9878 0.9875
dispersion: -0.061121617 hartree
energy: -2910.052771891628 hartree
dipole: -7.776755593 8.234856388 0.458100795 34.567830216 -25.826139093 8.741691122 7.001435893 -5.599393521 1.402042372
dipolemethod: SCF
magnitude: 8.865254809 au
magnitude: 22.533686943 debye
