program: Orca
programVersion: 6.0.1
elementType: O O C O O C C C F F F F F F O H H Co
charge: 0
multiplicity: 4
keywords: TPSS D3BJ TightOpt Freq def2-TZVPP def2/J RIJCOSX TightSCF defgrid3 CPCM(Acetonitrile)
frequency: 0.00 0.00 0.00 0.00 0.00 0.00 15.84 17.82 23.43 48.59 55.34 73.96 77.20 103.46 116.64 126.28 158.33 167.84 209.31 260.47 270.70 275.11 282.37 296.42 335.46 413.01 415.30 421.27 445.15 457.30 494.82 495.87 570.06 571.63 621.10 703.26 707.99 766.84 767.64 835.88 840.93 1065.62 1068.80 1110.79 1113.95 1153.11 1158.32 1446.62 1447.20 1547.60 1560.79 1611.33 3675.36 3753.01
frequency: 15.84 17.82 23.43 48.59 55.34 73.96 77.20 103.46 116.64 126.28 158.33 167.84 209.31 260.47 270.70 275.11 282.37 296.42 335.46 413.01 415.30 421.27 445.15 457.30 494.82 495.87 570.06 571.63 621.10 703.26 707.99 766.84 767.64 835.88 840.93 1065.62 1068.80 1110.79 1113.95 1153.11 1158.32 1446.62 1447.20 1547.60 1560.79 1611.33 3675.36 3753.01
formula: C4H2CoF6O5
InChI: InChI=1/2C2F3O2.Co.H2O/c2*3-2(4,5)1(6)7;;/h;;;1H2/q2*-2;+4;/rC4H2CoF6O5/c6-3(7,8)1-13-5(12,14-1)15-2(16-5)4(9,10)11/h12H2
18 atoms
O  1.369637 1.999872 7.884806
O  2.874959 5.752004 7.09734
C  2.094243 5.751825 6.103933
O  3.029475 2.85864 9.067926
O  1.207717 4.862843 5.947817
C  2.306166 1.881715 8.729615
C  2.538013 0.490905 9.362821
C  2.202829 6.897671 5.072189
F  2.694627 -0.450958 8.404067
F  1.468088 0.138181 10.11671
F  3.62803 0.468615 10.152141
F  1.5194 7.98142 5.521705
F  3.485876 7.269645 4.881562
F  1.685021 6.549155 3.878078
O  0.670839 4.881586 9.102908
H  0.638948 5.852377 9.14527
H  0.704918 4.564244 10.021167
Co 1.869989 4.010426 7.728616
totalener: -2512.38820928953646 hartree
nucrepener: 1619.01422562400535 hartree
electener: -4131.37560087773272 hartree
oneelecener: -6703.74956001355622 hartree
twoeener: 2572.37395913582304 hartree
cpcmener: -0.02683403580878 hartree
kineticenergy: 2506.18627612067212 hartree
exchangeener: -182.434601570429 hartree
correlationener: -5.424885881014 hartree
xcener: -187.859487451442 hartree
s2: 3.754009
dispersion: -0.019620736 hartree
s2: 3.753991
dispersion: -0.019596673 hartree
s2: 3.753940
dispersion: -0.019533705 hartree
s2: 3.753905
dispersion: -0.019492138 hartree
s2: 3.753887
dispersion: -0.019470030 hartree
s2: 3.753876
dispersion: -0.019459683 hartree
s2: 3.753873
dispersion: -0.019459147 hartree
s2: 3.753894
dispersion: -0.019506376 hartree
s2: 3.753884
dispersion: -0.019481895 hartree
s2: 3.753893
dispersion: -0.019481073 hartree
s2: 3.753914
dispersion: -0.019482603 hartree
s2: 3.753933
dispersion: -0.019494055 hartree
s2: 3.753941
dispersion: -0.019499947 hartree
s2: 3.753938
dispersion: -0.019500352 hartree
s2: 3.753923
dispersion: -0.019489991 hartree
s2: 3.753906
dispersion: -0.019476755 hartree
s2: 3.753897
dispersion: -0.019465692 hartree
dispersion: -0.019457829 hartree
dispersion: -0.019451515 hartree
dispersion: -0.019448290 hartree
s2: 3.753902
dispersion: -0.019445617 hartree
dispersion: -0.019443666 hartree
s2: 3.753907
dispersion: -0.019442356 hartree
dispersion: -0.019441707 hartree
s2: 3.753904
dispersion: -0.019441413 hartree
dispersion: -0.019442090 hartree
s2: 3.753901
dispersion: -0.019442427 hartree
dispersion: -0.019443164 hartree
dispersion: -0.019443007 hartree
elementType: O C F H Co
energy: -7529.9044 -884.7795 -766.6657 -766.5170 -766.4393 -665.5086 -665.5021 -665.4987 -665.4915 -665.4913 -665.4899 -515.6979 -514.7513 -514.7316 -514.7300 -514.7078 -278.9227 -278.9226 -275.9616 -275.9614 -100.6653 -65.5735 -65.2622 -65.1799 -33.8998 -33.8996 -31.6796 -31.6792 -31.6313 -31.6304 -28.5439 -28.4805 -27.3486 -25.9001 -25.8871 -19.0325 -19.0025 -16.1676 -16.1195 -15.0572 -15.0560 -15.0302 -15.0281 -14.6412 -13.2844 -13.1413 -12.3001 -12.2756 -12.1674 -11.8593 -11.8579 -11.5868 -11.5692 -11.4825 -11.4677 -11.3667 -11.0637 -10.6256 -10.6218 -10.5063 -10.5052 -10.0783 -10.0771 -9.7566 -9.1959 -9.1360 -8.6413 -8.3239 -8.0040 -7.8718 -7.5904 -7.3148 -7.2274 -7.1410 -6.0654 -2.0516 -1.8866 -0.6272 0.6360 1.5594 1.8329 2.1537 2.3429 2.5763 2.8917 3.1265 electronvolt
energy: -7529.8837 -883.4560 -765.5451 -765.4438 -765.4048 -665.5073 -665.5011 -665.4979 -665.4911 -665.4907 -665.4894 -515.6442 -514.6991 -514.6804 -514.6782 -514.6568 -278.9241 -278.9241 -275.9631 -275.9630 -97.3881 -62.2079 -62.0092 -61.9934 -33.8988 -33.8984 -31.6778 -31.6773 -31.6304 -31.6293 -28.4648 -28.4038 -27.2605 -25.8042 -25.7947 -19.0184 -18.9918 -16.1488 -16.1068 -15.0567 -15.0556 -15.0248 -15.0244 -14.6033 -13.2304 -13.1011 -12.1156 -12.0699 -12.0556 -11.8235 -11.7679 -11.5672 -11.5611 -11.4546 -11.4378 -11.1663 -11.0050 -10.6212 -10.6165 -10.4915 -10.4855 -10.0770 -10.0758 -9.2216 -8.7007 -8.1604 -8.1067 -8.0377 -7.9222 -7.6513 -6.2051 -6.1482 -4.2031 -3.7868 -3.0492 -1.9612 -1.8446 -0.3901 0.8981 1.6556 1.8555 2.2033 2.5494 electronvolt
chargesum: 0.0000000
charge: -0.416282 -0.415341 0.356148 -0.407202 -0.408933 0.352204 0.407886 0.407366 -0.143611 -0.145523 -0.140045 -0.147302 -0.141529 -0.140553 -0.390377 0.297178 0.296986 0.778931
charge: 0.133151 0.132474 -0.518555 0.135118 0.135673 -0.518849 -0.630721 -0.630474 0.199069 0.195969 0.208802 0.193223 0.203905 0.206739 0.460902 -0.035926 -0.036112 0.165612
qa: -0.4163 -0.4153 0.3561 -0.4072 -0.4089 0.3522 0.4079 0.4074 -0.1436 -0.1455 -0.1400 -0.1473 -0.1415 -0.1406 -0.3904 0.2972 0.2970 0.7789
va: 2.0802 2.0709 3.9785 2.0717 2.0796 3.9868 4.5628 4.5632 1.1698 1.1665 1.1808 1.1629 1.1751 1.1784 2.2005 0.9604 0.9605 4.4453
dispersion: -0.019442554 hartree
energy: -2512.412455537969 hartree
dipole: -3.202321793 2.227246944 -0.975074848 2.983396160 -1.810458656 1.172937504 4.656272573 -2.846367185 1.809905388
dipolemethod: SCF
magnitude: 2.366920122 au
magnitude: 6.016232832 debye
temp: 298.15 k
press: 1.00 atm
zeropoint: 0.07781112 hartree
thermalvibcorrection: 0.01552873 hartree
thermalrotcorrection: 0.00141627 hartree
thermaltrasncorrection: 0.00141627 hartree
thermaltotal: -2512.31628315 hartree
thermalcorr: 0.01836127 hartree
nonthermalcorr: 0.07781112 hartree
totalcorr: 0.09617239 hartree
thermalcorrenthalpy: 0.00094421 hartree
totalenthalpy: -2512.31533894 hartree
vibrat: 0.02919428 hartree
rotat: 0.01591448 hartree
transl: 0.02044114 hartree
total: 0.06685881 hartree
totalentropycorr: -0.06685881 hartree
gibbsenthalpy: -2512.38219775 hartree
gibbsminuselec: 0.03025778 hartree
