program: Orca
programVersion: 6.0.1
elementType: O O C O O C C C F F F F F F O H H Co O H H C N C H H H C N C H H H
charge: 0
multiplicity: 4
keywords: b3lyp d3bj def2-TZVPP def2/J RIJCOSX TightSCF defgrid3 CPCM(Acetonitrile)
formula: C8H10CoF6N2O6
InChI: InChI=1/2C2F3O2.2C2H3N.Co.2H2O/c2*3-2(4,5)1(6)7;2*1-2-3;;;/h;;2*1H3;;2*1H2/q2*-1;;;+2;;/rC8H10CoF6N2O6/c1-3-16-9(20,21,17-4-2,22-5(18)7(10,11)12)23-6(19)8(13,14)15/h20-21H2,1-2H3
33 atoms
O  0.830335 1.080691 8.41798
O  3.981295 6.539714 5.853982
C  2.742466 6.465785 5.716911
O  2.87715 2.033338 8.139345
O  1.933275 5.590688 6.135913
C  2.068754 1.156921 8.557186
C  2.767472 0.029718 9.379808
C  2.045354 7.593338 4.893443
F  3.784689 -0.537158 8.679428
F  1.923934 -0.963618 9.736761
F  3.303049 0.534519 10.525401
F  1.01634 8.149866 5.584335
F  2.886531 8.593986 4.551479
F  1.526756 7.090742 3.738877
O  0.408947 3.169393 6.8806
H  0.210571 2.901227 5.969298
H  0.401929 2.327304 7.434326
Co 2.404955 3.811819 7.137299
O  4.401543 4.453006 7.393928
H  4.599234 4.722415 8.305016
H  4.409126 5.294307 6.83895
C  3.194814 2.596243 4.256109
N  2.899505 3.023102 5.288901
C  3.567121 2.06462 2.959961
H  3.913106 2.879203 2.318078
H  4.368803 1.331636 3.084321
H  2.699817 1.581662 2.501729
C  1.627903 5.030961 10.0206
N  1.912594 4.601366 8.985962
C  1.270926 5.565868 11.319677
H  1.80368 5.013764 12.098675
H  1.545701 6.622966 11.367635
H  0.193194 5.461481 11.471638
elementType: O C F H Co N
totalener: -2853.69455274958591 hartree
nucrepener: 2682.56569365950236 hartree
electener: -5536.21126393354461 hartree
oneelecener: -9294.50562770156648 hartree
twoeener: 3758.29436376802141 hartree
cpcmener: -0.04898966534121 hartree
kineticenergy: 2845.80070816281932 hartree
exchangeener: -180.051915511623 hartree
correlationener: -8.827478987337 hartree
xcener: -188.879394498960 hartree
s2: 3.757200
energy: -7552.7335 -895.0140 -776.5897 -776.3601 -776.0751 -672.6781 -672.6778 -672.6675 -672.6671 -672.6656 -672.6655 -520.9495 -520.9486 -520.5024 -520.5012 -520.3522 -520.3516 -390.4305 -390.4302 -283.7656 -283.7654 -280.6251 -280.6247 -278.9968 -278.9962 -277.9271 -277.9265 -104.1785 -68.8749 -68.4127 -67.8595 -35.7830 -35.7829 -33.4946 -33.4946 -33.4545 -33.4543 -29.4914 -29.4716 -27.8759 -27.8665 -27.1992 -27.1589 -25.6950 -25.6843 -21.2051 -21.2003 -20.1174 -20.1102 -17.3103 -17.2895 -16.3040 -16.3038 -16.2815 -16.2739 -14.9774 -14.9324 -14.6667 -14.3263 -14.2564 -14.1441 -13.3476 -13.0926 -13.0920 -13.0726 -13.0530 -12.9694 -12.8557 -12.6275 -12.6031 -12.5892 -12.5688 -12.5265 -12.4507 -12.3560 -12.1684 -12.0090 -12.0077 -11.9666 -11.9197 -11.6494 -11.5607 -11.5093 -11.4625 -11.4472 -11.0291 -10.2543 -10.0470 -10.0000 -9.8760 -9.7969 -9.6412 -9.4895 -8.9667 -8.7714 -8.4715 -8.4230 -8.1238 -8.0577 -8.0413 -7.6051 -7.2084 -0.4611 -0.4427 -0.0936 -0.0026 0.1733 0.2672 0.3991 0.9386 1.5730 1.6852 2.5122 electronvolt
energy: -7552.7011 -893.2369 -774.9807 -774.8821 -774.7555 -672.6770 -672.6767 -672.6676 -672.6672 -672.6656 -672.6655 -520.9001 -520.8992 -520.4550 -520.4538 -520.3530 -520.3525 -390.3931 -390.3927 -283.7621 -283.7619 -280.6257 -280.6252 -278.9949 -278.9943 -277.9260 -277.9254 -100.1497 -64.1878 -64.1351 -64.0694 -35.7818 -35.7817 -33.4931 -33.4930 -33.4544 -33.4543 -29.4553 -29.4368 -27.7794 -27.7739 -27.1528 -27.1121 -25.6520 -25.6437 -21.1999 -21.1961 -20.1017 -20.0972 -17.2838 -17.2734 -16.3030 -16.3028 -16.2758 -16.2700 -14.9241 -14.9021 -14.5322 -14.2250 -14.1472 -14.0992 -13.2836 -13.0821 -13.0691 -13.0466 -12.9953 -12.8133 -12.6180 -12.5879 -12.5867 -12.5656 -12.4793 -12.4257 -12.3491 -12.1104 -12.0454 -11.9961 -11.9852 -11.9526 -11.6386 -11.4960 -11.4637 -11.4406 -11.4364 -11.4049 -10.1635 -9.9957 -9.9905 -9.8410 -9.5527 -9.3350 -8.6682 -8.4982 -8.3960 -8.3115 -8.1879 -8.0252 -7.1393 -6.9061 -2.2142 -1.0111 -0.5095 -0.4372 -0.3459 -0.0672 0.0197 0.3077 0.3801 0.4545 0.9407 electronvolt
chargesum: 0.0000000
charge: -0.464638 -0.464967 0.274174 -0.485891 -0.485864 0.273513 0.506551 0.506442 -0.188199 -0.182920 -0.190645 -0.187986 -0.182947 -0.190775 -0.447494 0.247165 0.247841 0.801811 -0.447224 0.246882 0.247856 0.015104 -0.045037 -0.126312 0.146594 0.146560 0.146560 0.015772 -0.045135 -0.126790 0.146731 0.146464 0.146803
charge: 0.065575 0.065600 -0.537055 0.114952 0.115012 -0.537128 -0.594143 -0.594149 0.168415 0.179667 0.164766 0.168754 0.179598 0.164550 0.376520 -0.078908 -0.150884 -0.169951 0.376443 -0.079024 -0.150960 -0.034899 0.194838 0.044462 0.057113 0.057350 0.057280 -0.034891 0.194839 0.044423 0.057280 0.057044 0.057507
qa: -0.4646 -0.4650 0.2742 -0.4859 -0.4859 0.2735 0.5066 0.5064 -0.1882 -0.1829 -0.1906 -0.1880 -0.1829 -0.1908 -0.4475 0.2472 0.2478 0.8018 -0.4472 0.2469 0.2479 0.0151 -0.0450 -0.1263 0.1466 0.1466 0.1466 0.0158 -0.0451 -0.1268 0.1467 0.1465 0.1468
va: 2.0156 2.0152 4.2735 1.9517 1.9520 4.2746 4.4425 4.4425 1.1045 1.1197 1.0998 1.1048 1.1196 1.0996 2.0570 1.0023 1.0725 4.5700 2.0572 1.0026 1.0725 3.6748 3.1276 3.8313 0.9875 0.9874 0.9875 3.6738 3.1273 3.8310 0.9875 0.9876 0.9873
dispersion: -0.055212918 hartree
energy: -2853.749765667639 hartree
dipole: 0.080622178 -0.063436357 0.017185820 0.019045597 -0.011749314 0.007296283 0.022422241 -0.015470806 0.006951435
dipolemethod: SCF
magnitude: 0.019922616 au
magnitude: 0.050639265 debye
