program: Orca
programVersion: 6.0.1
elementType: O O C O O C C C F F F F F F O H H Co O H H C N C H H H C N C H H H
charge: 0
multiplicity: 4
keywords: TPSS D3BJ TightOpt Freq def2-TZVPP def2/J RIJCOSX TightSCF defgrid3 CPCM(Acetonitrile)
frequency: 0.00 0.00 0.00 0.00 0.00 0.00 5.20 7.46 10.05 11.91 19.91 23.41 34.12 37.91 39.39 42.61 48.28 58.42 64.45 91.41 114.61 120.09 123.94 158.17 160.31 170.48 173.18 182.73 186.51 218.70 224.61 230.44 258.07 262.33 267.36 269.63 294.18 311.58 327.10 396.49 399.92 401.75 403.07 423.64 425.60 444.45 446.54 450.06 454.34 493.50 493.73 579.78 580.40 606.16 617.92 688.40 688.89 764.80 765.40 791.42 793.35 934.57 934.87 961.04 965.35 1038.01 1039.16 1040.09 1041.57 1046.30 1046.45 1092.71 1092.77 1150.35 1153.11 1381.41 1383.88 1386.90 1387.06 1436.05 1436.60 1437.11 1437.36 1593.54 1595.28 1626.25 1632.33 2312.33 2312.94 2990.47 2991.23 3019.91 3020.14 3097.41 3097.46 3097.85 3098.26 3727.78 3727.99
frequency: 5.20 7.46 10.05 11.91 19.91 23.41 34.12 37.91 39.39 42.61 48.28 58.42 64.45 91.41 114.61 120.09 123.94 158.17 160.31 170.48 173.18 182.73 186.51 218.70 224.61 230.44 258.07 262.33 267.36 269.63 294.18 311.58 327.10 396.49 399.92 401.75 403.07 423.64 425.60 444.45 446.54 450.06 454.34 493.50 493.73 579.78 580.40 606.16 617.92 688.40 688.89 764.80 765.40 791.42 793.35 934.57 934.87 961.04 965.35 1038.01 1039.16 1040.09 1041.57 1046.30 1046.45 1092.71 1092.77 1150.35 1153.11 1381.41 1383.88 1386.90 1387.06 1436.05 1436.60 1437.11 1437.36 1593.54 1595.28 1626.25 1632.33 2312.33 2312.94 2990.47 2991.23 3019.91 3020.14 3097.41 3097.46 3097.85 3098.26 3727.78 3727.99
formula: C8H10CoF6N2O6
InChI: InChI=1/2C2F3O2.2C2H3N.Co.2H2O/c2*3-2(4,5)1(6)7;2*1-2-3;;;/h;;2*1H3;;2*1H2/q2*-1;;;+2;;/rC8H10CoF6N2O6/c1-3-16-9(20,21,17-4-2,22-5(18)7(10,11)12)23-6(19)8(13,14)15/h20-21H2,1-2H3
33 atoms
O  0.830335 1.080691 8.41798
O  3.981295 6.539714 5.853982
C  2.742466 6.465785 5.716911
O  2.87715 2.033338 8.139345
O  1.933275 5.590688 6.135913
C  2.068754 1.156921 8.557186
C  2.767472 0.029718 9.379808
C  2.045354 7.593338 4.893443
F  3.784689 -0.537158 8.679428
F  1.923934 -0.963618 9.736761
F  3.303049 0.534519 10.525401
F  1.01634 8.149866 5.584335
F  2.886531 8.593986 4.551479
F  1.526756 7.090742 3.738877
O  0.408947 3.169393 6.8806
H  0.210571 2.901227 5.969298
H  0.401929 2.327304 7.434326
Co 2.404955 3.811819 7.137299
O  4.401543 4.453006 7.393928
H  4.599234 4.722415 8.305016
H  4.409126 5.294307 6.83895
C  3.194814 2.596243 4.256109
N  2.899505 3.023102 5.288901
C  3.567121 2.06462 2.959961
H  3.913106 2.879203 2.318078
H  4.368803 1.331636 3.084321
H  2.699817 1.581662 2.501729
C  1.627903 5.030961 10.0206
N  1.912594 4.601366 8.985962
C  1.270926 5.565868 11.319677
H  1.80368 5.013764 12.098675
H  1.545701 6.622966 11.367635
H  0.193194 5.461481 11.471638
totalener: -2854.59864665977193 hartree
nucrepener: 2703.01720029202488 hartree
electener: -5557.57113222121188 hartree
oneelecener: -9335.46028047731124 hartree
twoeener: 3777.88914825609936 hartree
cpcmener: -0.04471473058448 hartree
kineticenergy: 2846.93747254799882 hartree
exchangeener: -227.785117602031 hartree
correlationener: -7.197064978335 hartree
xcener: -234.982182580366 hartree
s2: 3.757195
dispersion: -0.042114637 hartree
s2: 3.757081
dispersion: -0.042012653 hartree
s2: 3.756596
dispersion: -0.041454933 hartree
s2: 3.756463
dispersion: -0.041430556 hartree
s2: 3.756296
dispersion: -0.041414670 hartree
s2: 3.756345
dispersion: -0.041380829 hartree
s2: 3.756407
dispersion: -0.041372280 hartree
s2: 3.756386
dispersion: -0.041371993 hartree
s2: 3.756392
dispersion: -0.041369848 hartree
s2: 3.756437
dispersion: -0.041371953 hartree
s2: 3.756489
dispersion: -0.041380860 hartree
s2: 3.756531
dispersion: -0.041390633 hartree
s2: 3.756548
dispersion: -0.041391197 hartree
dispersion: -0.041392853 hartree
s2: 3.756551
dispersion: -0.041409421 hartree
s2: 3.756562
dispersion: -0.041428658 hartree
s2: 3.756582
dispersion: -0.041467434 hartree
s2: 3.756593
dispersion: -0.041472775 hartree
s2: 3.756609
dispersion: -0.041486573 hartree
s2: 3.756616
dispersion: -0.041490933 hartree
s2: 3.756622
dispersion: -0.041495015 hartree
s2: 3.756628
dispersion: -0.041501393 hartree
dispersion: -0.041509589 hartree
s2: 3.756631
dispersion: -0.041514863 hartree
s2: 3.756629
dispersion: -0.041516000 hartree
s2: 3.756627
dispersion: -0.041513900 hartree
dispersion: -0.041515610 hartree
dispersion: -0.041518724 hartree
s2: 3.756625
dispersion: -0.041518390 hartree
s2: 3.756620
dispersion: -0.041516279 hartree
s2: 3.756619
dispersion: -0.041515221 hartree
s2: 3.756617
dispersion: -0.041515320 hartree
s2: 3.756618
dispersion: -0.041518141 hartree
dispersion: -0.041521685 hartree
s2: 3.756621
dispersion: -0.041526174 hartree
dispersion: -0.041536876 hartree
s2: 3.756626
dispersion: -0.041540109 hartree
s2: 3.756623
dispersion: -0.041541825 hartree
dispersion: -0.041540858 hartree
dispersion: -0.041540547 hartree
elementType: O C F H Co N
energy: -7529.2215 -884.1716 -766.1495 -765.9449 -765.6831 -665.1755 -665.1752 -665.1608 -665.1600 -665.1577 -665.1573 -514.4428 -514.4421 -513.9813 -513.9803 -513.7392 -513.7389 -384.5738 -384.5732 -278.3934 -278.3932 -275.2843 -275.2839 -273.7304 -273.7299 -272.9696 -272.9690 -100.0330 -65.1391 -64.7176 -64.2063 -33.5098 -33.5097 -31.3032 -31.3031 -31.2612 -31.2611 -27.5393 -27.5195 -26.1233 -26.1139 -25.3309 -25.2969 -23.8919 -23.8816 -19.7294 -19.7248 -18.4253 -18.4187 -15.6834 -15.6659 -14.6795 -14.6793 -14.6559 -14.6475 -13.6496 -13.6119 -13.3563 -13.0657 -12.8655 -12.7083 -11.9840 -11.5878 -11.5531 -11.5284 -11.5005 -11.4908 -11.4708 -11.4076 -11.3824 -11.2825 -11.2598 -11.1451 -10.9544 -10.8278 -10.7325 -10.4675 -10.3877 -10.3158 -10.2943 -10.2580 -10.1029 -10.0294 -9.7745 -9.7737 -9.4328 -9.0443 -8.9849 -8.8772 -8.6706 -8.2498 -8.2216 -7.7955 -7.5497 -7.3450 -7.2441 -6.8937 -6.8009 -6.5753 -6.3995 -5.7710 -5.5574 -1.2008 -1.1984 -0.8382 -0.7664 -0.5803 -0.5024 0.1105 0.6649 1.2050 1.3857 2.2195 electronvolt
energy: -7529.2022 -882.7993 -764.9312 -764.8229 -764.6807 -665.1739 -665.1736 -665.1609 -665.1601 -665.1576 -665.1573 -514.3882 -514.3874 -513.9288 -513.9279 -513.7389 -513.7387 -384.5385 -384.5379 -278.3888 -278.3886 -275.2851 -275.2846 -273.7290 -273.7285 -272.9680 -272.9675 -96.6622 -61.4392 -61.3408 -61.2206 -33.5082 -33.5081 -31.3013 -31.3012 -31.2611 -31.2609 -27.5026 -27.4843 -26.0323 -26.0257 -25.2855 -25.2518 -23.8569 -23.8486 -19.7240 -19.7202 -18.4097 -18.4051 -15.6620 -15.6519 -14.6777 -14.6776 -14.6499 -14.6432 -13.6089 -13.5826 -13.2632 -13.0493 -12.7671 -12.6637 -11.9088 -11.5595 -11.5238 -11.4990 -11.4985 -11.4618 -11.3989 -11.3810 -11.3146 -11.2491 -11.1163 -11.0997 -10.9355 -10.6906 -10.5595 -10.4456 -10.3197 -10.3056 -10.1679 -10.1477 -10.0590 -10.0211 -9.7736 -9.7729 -9.0659 -8.9530 -8.9453 -8.8436 -8.3733 -8.1035 -7.4767 -7.4016 -7.3164 -7.1122 -6.9353 -6.7831 -5.4707 -5.3219 -3.8342 -2.5345 -2.0526 -1.1928 -1.1344 -0.8060 -0.7385 -0.4791 -0.4240 0.1402 0.6683 electronvolt
chargesum: -0.0000000
charge: -0.437578 -0.437942 0.274487 -0.450853 -0.450836 0.273705 0.409725 0.409602 -0.159985 -0.154721 -0.162255 -0.159781 -0.154758 -0.162359 -0.443790 0.258643 0.250008 0.686476 -0.443409 0.258331 0.250034 -0.114178 0.071374 -0.028671 0.114793 0.115077 0.115066 -0.113736 0.071371 -0.028926 0.115020 0.114873 0.115197
charge: 0.082007 0.082035 -0.554751 0.135182 0.135247 -0.554818 -0.623549 -0.623554 0.178167 0.189369 0.174604 0.178497 0.189298 0.174401 0.388987 -0.077618 -0.153441 -0.211432 0.388933 -0.077733 -0.153510 -0.045002 0.197360 0.050558 0.054444 0.054765 0.054686 -0.045021 0.197391 0.050516 0.054698 0.054381 0.054904
qa: -0.4376 -0.4379 0.2745 -0.4509 -0.4508 0.2737 0.4097 0.4096 -0.1600 -0.1547 -0.1623 -0.1598 -0.1548 -0.1624 -0.4438 0.2586 0.2500 0.6865 -0.4434 0.2583 0.2500 -0.1142 0.0714 -0.0287 0.1148 0.1151 0.1151 -0.1137 0.0714 -0.0289 0.1150 0.1149 0.1152
va: 2.0585 2.0581 4.2574 2.0108 2.0110 4.2585 4.5304 4.5305 1.1426 1.1587 1.1379 1.1430 1.1586 1.1377 2.0655 0.9914 1.0725 4.7123 2.0658 0.9917 1.0725 3.7813 3.0810 3.9143 1.0036 1.0035 1.0035 3.7811 3.0806 3.9143 1.0037 1.0036 1.0034
dispersion: -0.041543650 hartree
energy: -2854.642956612048 hartree
dipole: 0.080622881 -0.063741225 0.016881656 0.019047124 -0.012258812 0.006788313 0.022424399 -0.015679926 0.006744473
dipolemethod: SCF
magnitude: 0.019405138 au
magnitude: 0.049323942 debye
temp: 298.15 k
press: 1.00 atm
zeropoint: 0.19460556 hartree
thermalvibcorrection: 0.02760678 hartree
thermalrotcorrection: 0.00141627 hartree
thermaltrasncorrection: 0.00141627 hartree
thermaltotal: -2854.41791173 hartree
thermalcorr: 0.03043932 hartree
nonthermalcorr: 0.19460556 hartree
totalcorr: 0.22504488 hartree
thermalcorrenthalpy: 0.00094421 hartree
totalenthalpy: -2854.41696752 hartree
vibrat: 0.05412460 hartree
rotat: 0.01691085 hartree
transl: 0.02084552 hartree
total: 0.09318989 hartree
totalentropycorr: -0.09318989 hartree
gibbsenthalpy: -2854.51015741 hartree
gibbsminuselec: 0.13279920 hartree
