program: Orca
programVersion: 6.0.1
elementType: O O C O O C C C F F F F F F O H H O H H Co
charge: 0
multiplicity: 4
keywords: b3lyp d3bj def2-TZVPP def2/J RIJCOSX TightSCF defgrid3 CPCM(Acetonitrile)
formula: C4H4CoF6O6
InChI: InChI=1/2C2F3O2.Co.2H2O/c2*3-2(4,5)1(6)7;;;/h;;;2*1H2/q2*-1;+2;;/rC4H4CoF6O6/c6-3(7,8)1(12)16-5(14,15)17-2(13)4(9,10)11/h14-15H2
21 atoms
O  1.531572 0.686226 7.598433
O  3.712408 6.423117 6.03097
C  2.512461 6.329127 6.325622
O  2.573782 2.592828 8.277689
O  1.815358 5.280684 6.559703
C  2.077948 1.423354 8.432506
C  2.214586 0.910905 9.897058
C  1.673964 7.636101 6.449413
F  1.676908 -0.313528 10.060869
F  1.595492 1.752266 10.762608
F  3.519985 0.839718 10.261337
F  1.202591 7.783886 7.713661
F  2.395392 8.733968 6.150834
F  0.603873 7.606773 5.616651
O  1.608814 2.155164 5.436727
H  2.031925 1.804381 4.635481
H  1.507882 1.40012 6.098253
O  4.447201 3.908399 5.903971
H  5.197519 3.598525 6.438319
H  4.43261 4.914975 5.937357
Co 2.593211 3.493432 6.541951
elementType: O C F H Co
totalener: -2588.18844514021839 hartree
nucrepener: 1767.84476739552497 hartree
electener: -4356.00176681597895 hartree
oneelecener: -7106.12224988740309 hartree
twoeener: 2750.12048307142413 hartree
cpcmener: -0.03144786967856 hartree
kineticenergy: 2581.62206465096961 hartree
exchangeener: -151.444141438191 hartree
correlationener: -7.097249877126 hartree
xcener: -158.541391315316 hartree
s2: 3.754749
energy: -7553.4652 -895.7600 -777.1354 -777.1115 -777.0288 -672.8587 -672.8584 -672.8478 -672.8465 -672.8465 -672.8463 -521.8448 -521.8283 -521.2949 -521.2817 -520.8974 -520.8944 -284.0489 -284.0484 -281.1742 -281.1670 -104.9307 -69.2303 -69.1711 -69.0285 -36.0026 -36.0021 -33.7049 -33.7046 -33.6592 -33.6588 -30.0870 -30.0623 -28.6927 -28.6615 -27.8010 -27.7688 -20.4368 -20.4249 -17.6571 -17.6302 -16.5142 -16.5141 -16.5083 -16.5043 -15.7895 -15.7506 -15.0166 -14.9617 -13.8301 -13.7443 -13.2929 -13.2810 -13.1650 -13.1627 -13.0979 -13.0694 -12.7548 -12.7110 -12.3536 -12.2986 -12.1764 -12.1719 -11.9600 -11.9304 -11.6293 -11.6287 -11.3532 -11.0827 -10.7032 -10.5582 -10.0217 -9.6049 -9.4441 -9.0996 -8.8190 -8.5549 -8.5164 -8.3082 -8.2878 -0.9354 -0.9015 -0.2492 1.1669 1.8321 2.2906 2.6884 2.9434 3.2446 3.2981 3.6581 electronvolt
energy: -7553.4297 -894.0434 -775.6922 -775.6859 -775.6348 -672.8575 -672.8573 -672.8477 -672.8463 -672.8463 -672.8462 -521.7962 -521.7798 -521.2424 -521.2286 -520.8956 -520.8932 -284.0454 -284.0447 -281.1732 -281.1662 -101.0198 -65.0189 -65.0174 -64.9980 -36.0010 -36.0005 -33.7030 -33.7026 -33.6589 -33.6584 -30.0376 -30.0136 -28.5918 -28.5599 -27.7397 -27.7054 -20.4171 -20.4053 -17.6270 -17.5997 -16.5125 -16.5123 -16.5000 -16.4947 -15.7243 -15.6867 -14.8974 -14.7657 -13.7327 -13.5296 -13.2728 -13.2639 -13.1572 -13.1385 -12.7234 -12.6984 -12.5237 -12.4785 -12.3027 -12.2342 -12.1668 -12.1597 -11.9168 -11.8908 -11.6279 -11.6271 -10.5809 -10.5114 -9.5424 -9.3497 -9.3005 -9.0306 -8.7078 -8.5798 -7.8369 -7.7612 -2.4462 -2.2349 -2.2190 -0.8109 -0.7857 -0.1200 1.2122 1.9169 2.3691 2.7420 3.0077 electronvolt
chargesum: 0.0000000
charge: -0.424068 -0.423691 0.340980 -0.482835 -0.486352 0.340674 0.508333 0.507687 -0.174596 -0.180389 -0.181026 -0.180766 -0.174426 -0.180140 -0.420822 0.280440 0.270237 -0.417630 0.280064 0.268941 0.929387
charge: 0.104695 0.103924 -0.499162 0.111121 0.111344 -0.499741 -0.599828 -0.600048 0.191544 0.177927 0.177007 0.177056 0.191741 0.178309 0.407657 -0.053138 -0.129611 0.406225 -0.053244 -0.128321 0.224543
qa: -0.4241 -0.4237 0.3410 -0.4828 -0.4864 0.3407 0.5083 0.5077 -0.1746 -0.1804 -0.1810 -0.1808 -0.1744 -0.1801 -0.4208 0.2804 0.2702 -0.4176 0.2801 0.2689 0.9294
va: 2.0708 2.0718 4.1766 2.0051 2.0114 4.1789 4.4457 4.4458 1.1334 1.1167 1.1154 1.1158 1.1336 1.1170 2.1494 0.9804 1.0501 2.1425 0.9807 1.0502 4.3975
dispersion: -0.031679895 hartree
energy: -2588.220125035573 hartree
dipole: 4.795096439 -3.098147446 1.696948993 -4.587570806 3.210292418 -1.377278388 -7.825793537 5.901886441 -1.923907095
dipolemethod: SCF
magnitude: 2.911691974 au
magnitude: 7.400932837 debye
