program: Orca
programVersion: 6.0.1
elementType: O O C O O C C C F F F F F F O H H O H H Co
charge: 0
multiplicity: 4
keywords: TPSS D3BJ TightOpt Freq def2-TZVPP def2/J RIJCOSX TightSCF defgrid3 CPCM(Acetonitrile)
frequency: 0.00 0.00 0.00 0.00 0.00 0.00 14.51 17.24 23.10 32.30 50.16 60.86 81.43 95.40 102.71 116.02 123.84 140.53 164.75 172.57 206.94 230.72 258.36 273.05 277.68 310.97 345.23 356.08 409.84 415.90 423.12 434.54 464.06 484.91 494.04 494.41 572.81 591.72 614.58 628.24 694.04 703.03 763.72 767.08 803.44 831.38 923.94 1055.62 1063.45 1102.57 1104.56 1149.05 1156.48 1382.52 1429.09 1543.88 1582.58 1605.77 1638.23 3052.24 3670.34 3727.89 3749.52
frequency: 14.51 17.24 23.10 32.30 50.16 60.86 81.43 95.40 102.71 116.02 123.84 140.53 164.75 172.57 206.94 230.72 258.36 273.05 277.68 310.97 345.23 356.08 409.84 415.90 423.12 434.54 464.06 484.91 494.04 494.41 572.81 591.72 614.58 628.24 694.04 703.03 763.72 767.08 803.44 831.38 923.94 1055.62 1063.45 1102.57 1104.56 1149.05 1156.48 1382.52 1429.09 1543.88 1582.58 1605.77 1638.23 3052.24 3670.34 3727.89 3749.52
formula: C4H4CoF6O6
InChI: InChI=1/2C2F3O2.Co.2H2O/c2*3-2(4,5)1(6)7;;;/h;;;2*1H2/q2*-1;+2;;/rC4H4CoF6O6/c6-3(7,8)1(12)16-5(14,15)17-2(13)4(9,10)11/h14-15H2
21 atoms
O  1.060237 1.316002 8.454944
O  3.590035 5.319584 7.490993
C  3.13192 6.010352 6.524499
O  3.145244 2.144746 8.072256
O  2.396799 5.533178 5.632301
C  2.297078 1.32744 8.563202
C  2.972897 0.204741 9.40621
C  3.49986 7.511446 6.450546
F  3.819372 -0.529573 8.638289
F  2.076161 -0.643979 9.947924
F  3.702939 0.73256 10.421781
F  2.380914 8.275501 6.502058
F  4.3098 7.89781 7.456033
F  4.128939 7.787239 5.281655
O  0.670942 3.515082 7.080161
H  0.102782 3.531435 6.293279
H  0.561265 2.629572 7.543695
O  3.357424 2.837636 5.111936
H  4.13069 2.250608 5.165927
H  3.54453 3.476802 4.403672
Co 2.669809 3.631535 6.852794
totalener: -2588.88563503127807 hartree
nucrepener: 1800.90106750184805 hartree
electener: -4389.74926513686114 hartree
oneelecener: -7172.82648525284549 hartree
twoeener: 2783.07722011598389 hartree
cpcmener: -0.03743739626494 hartree
kineticenergy: 2582.39213254366587 hartree
exchangeener: -191.458736162693 hartree
correlationener: -5.761497500871 hartree
xcener: -197.220233663564 hartree
s2: 3.753619
dispersion: -0.023860733 hartree
s2: 3.753607
dispersion: -0.023791101 hartree
s2: 3.753562
dispersion: -0.023558789 hartree
s2: 3.753539
dispersion: -0.023471295 hartree
s2: 3.753530
dispersion: -0.023416067 hartree
s2: 3.753531
dispersion: -0.023368121 hartree
s2: 3.753550
dispersion: -0.023351712 hartree
s2: 3.753590
dispersion: -0.023341713 hartree
s2: 3.753638
dispersion: -0.023355579 hartree
s2: 3.753693
dispersion: -0.023375550 hartree
s2: 3.753710
dispersion: -0.023390267 hartree
s2: 3.753696
dispersion: -0.023388470 hartree
s2: 3.753661
dispersion: -0.023376778 hartree
s2: 3.753630
dispersion: -0.023386191 hartree
s2: 3.753610
dispersion: -0.023404729 hartree
s2: 3.753596
dispersion: -0.023462859 hartree
s2: 3.753600
dispersion: -0.023479756 hartree
dispersion: -0.023505221 hartree
s2: 3.753629
dispersion: -0.023506921 hartree
s2: 3.753633
dispersion: -0.023494469 hartree
s2: 3.753631
dispersion: -0.023486574 hartree
s2: 3.753628
dispersion: -0.023477513 hartree
dispersion: -0.023480553 hartree
dispersion: -0.023487940 hartree
dispersion: -0.023494741 hartree
s2: 3.753636
dispersion: -0.023499252 hartree
s2: 3.753639
dispersion: -0.023500089 hartree
s2: 3.753643
dispersion: -0.023498227 hartree
s2: 3.753647
dispersion: -0.023496454 hartree
s2: 3.753653
dispersion: -0.023496130 hartree
dispersion: -0.023498588 hartree
s2: 3.753668
dispersion: -0.023503784 hartree
s2: 3.753669
dispersion: -0.023506896 hartree
s2: 3.753664
dispersion: -0.023512126 hartree
s2: 3.753657
dispersion: -0.023520721 hartree
dispersion: -0.023531032 hartree
s2: 3.753645
dispersion: -0.023520885 hartree
s2: 3.753644
dispersion: -0.023519078 hartree
dispersion: -0.023515620 hartree
dispersion: -0.023516114 hartree
dispersion: -0.023518255 hartree
s2: 3.753654
dispersion: -0.023521885 hartree
s2: 3.753656
dispersion: -0.023521856 hartree
dispersion: -0.023518801 hartree
dispersion: -0.023514639 hartree
dispersion: -0.023513136 hartree
s2: 3.753649
dispersion: -0.023511730 hartree
s2: 3.753648
dispersion: -0.023512331 hartree
s2: 3.753646
dispersion: -0.023515597 hartree
dispersion: -0.023517168 hartree
dispersion: -0.023518202 hartree
dispersion: -0.023518212 hartree
dispersion: -0.023517685 hartree
dispersion: -0.023517204 hartree
dispersion: -0.023516795 hartree
dispersion: -0.023517085 hartree
dispersion: -0.023517609 hartree
dispersion: -0.023517280 hartree
dispersion: -0.023516799 hartree
elementType: O C F H Co
energy: -7529.5312 -884.4296 -766.2741 -766.2251 -766.0707 -665.4219 -665.4069 -665.4064 -665.3039 -665.2836 -665.2834 -515.5831 -515.0611 -514.6382 -514.5158 -514.3327 -514.1023 -278.7920 -278.5913 -275.7326 -275.6539 -100.3198 -65.1612 -65.0604 -64.7583 -33.7990 -33.6615 -31.5810 -31.5369 -31.4497 -31.4012 -28.2533 -27.9251 -27.2461 -26.6831 -25.7205 -25.7041 -18.8705 -18.6450 -16.0208 -15.9114 -14.9603 -14.9326 -14.8245 -14.8112 -14.5425 -14.2516 -13.2837 -13.0430 -12.2039 -12.0022 -11.9886 -11.7163 -11.5715 -11.4780 -11.4083 -11.3755 -11.2665 -11.1748 -11.0422 -10.6574 -10.5360 -10.4417 -10.4097 -10.2580 -9.9997 -9.8889 -9.5615 -9.1959 -8.8343 -8.7134 -8.1464 -7.9279 -7.7353 -7.3248 -7.0697 -6.8559 -6.8067 -6.7777 -6.0219 -1.7573 -1.5178 -0.5266 0.7137 1.3676 1.9454 2.2184 2.3140 2.5778 2.6827 3.0261 electronvolt
energy: -7529.5099 -883.1040 -765.1635 -765.1324 -765.0386 -665.4209 -665.4063 -665.4059 -665.3024 -665.2835 -665.2833 -515.5375 -515.0084 -514.5753 -514.4662 -514.2879 -514.1005 -278.7921 -278.5876 -275.7351 -275.6533 -97.0417 -61.7834 -61.7561 -61.6374 -33.7978 -33.6600 -31.5793 -31.5361 -31.4478 -31.4009 -28.1738 -27.8849 -27.1710 -26.5932 -25.6717 -25.6073 -18.8563 -18.6296 -16.0022 -15.8916 -14.9596 -14.9275 -14.8226 -14.8044 -14.5059 -14.2081 -13.2011 -12.9745 -12.0959 -11.8867 -11.7270 -11.6872 -11.5463 -11.4589 -11.3998 -11.3360 -11.1565 -11.0035 -10.8615 -10.6251 -10.5308 -10.4372 -10.3870 -10.2424 -9.9984 -9.8879 -9.1470 -8.9387 -8.2466 -7.9689 -7.8783 -7.7797 -7.4533 -7.1928 -5.8305 -5.8083 -3.5649 -3.5212 -2.8090 -1.6924 -1.4682 -0.3704 0.7811 1.4903 1.9682 2.2608 2.3554 electronvolt
chargesum: -0.0000000
charge: -0.408469 -0.434874 0.371790 -0.438712 -0.412974 0.306624 0.409861 0.411248 -0.155294 -0.148558 -0.154267 -0.148879 -0.143669 -0.148973 -0.423990 0.282822 0.261497 -0.404439 0.296474 0.293396 0.789384
charge: 0.106235 0.129750 -0.533605 0.131875 0.119152 -0.528422 -0.627398 -0.628388 0.183240 0.198123 0.184716 0.192321 0.203177 0.192282 0.418091 -0.058556 -0.136893 0.453641 -0.040073 -0.042697 0.083430
qa: -0.4085 -0.4349 0.3718 -0.4387 -0.4130 0.3066 0.4099 0.4112 -0.1553 -0.1486 -0.1543 -0.1489 -0.1437 -0.1490 -0.4240 0.2828 0.2615 -0.4044 0.2965 0.2934 0.7894
va: 2.0968 2.0521 3.9779 2.0655 2.0483 4.2066 4.5373 4.5509 1.1494 1.1694 1.1511 1.1613 1.1742 1.1612 2.1338 0.9769 1.0554 2.1647 0.9647 0.9655 4.4637
dispersion: -0.023516592 hartree
energy: -2588.917974629088 hartree
dipole: -4.975133348 5.056384440 0.081251092 -3.728223812 3.104631149 -0.623592663 -6.698403040 3.778614940 -2.919788100
dipolemethod: SCF
magnitude: 2.986742724 au
magnitude: 7.591696682 debye
temp: 298.15 k
press: 1.00 atm
zeropoint: 0.10247895 hartree
thermalvibcorrection: 0.01783905 hartree
thermalrotcorrection: 0.00141627 hartree
thermaltrasncorrection: 0.00141627 hartree
thermaltotal: -2588.79482408 hartree
thermalcorr: 0.02067159 hartree
nonthermalcorr: 0.10247895 hartree
totalcorr: 0.12315055 hartree
thermalcorrenthalpy: 0.00094421 hartree
totalenthalpy: -2588.79387987 hartree
vibrat: 0.03355198 hartree
rotat: 0.01615949 hartree
transl: 0.02052295 hartree
total: 0.07154333 hartree
totalentropycorr: -0.07154333 hartree
gibbsenthalpy: -2588.86542320 hartree
gibbsminuselec: 0.05255143 hartree
