program: Orca
programVersion: 6.0.1
elementType: O O C O O C C C F F F F F F Co C N C N C N C H H H C H H H C H H H
charge: 0
multiplicity: 4
keywords: b3lyp d3bj def2-TZVPP def2/J RIJCOSX TightSCF defgrid3 CPCM(Acetonitrile)
formula: C10H9CoF6N3O4
InChI: InChI=1/2C2F3O2.3C2H3N.Co/c2*3-2(4,5)1(6)7;3*1-2-3;/h;;3*1H3;/q;-1;;;;+1/rC8H9CoF3N3O2.C2F3O2/c1-4-13-9(14-5-2,15-6-3)17-7(16)8(10,11)12;3-2(4,5)1(6)7/h1-3H3;
33 atoms
O  0.947278 1.721101 9.698884
O  3.210303 6.024729 8.383272
C  2.658959 6.603245 7.415853
O  2.723168 3.095648 9.300169
O  1.848599 6.049564 6.62106
C  2.041145 2.224493 9.946728
C  2.788739 1.777774 11.247517
C  2.975795 8.096484 7.149618
F  4.021984 1.272745 10.969105
F  2.116911 0.826743 11.935651
F  2.97186 2.829045 12.09472
F  1.842107 8.844269 7.172989
F  3.825439 8.619323 8.058964
F  3.53974 8.257349 5.923844
Co 2.09806 4.187011 7.729374
C  -0.484069 5.155311 9.420318
N  0.417862 4.805488 8.788537
C  4.766944 3.489835 6.076932
N  3.808094 3.732125 6.674717
C  0.297487 2.240976 5.943639
N  0.935419 2.947897 6.598592
C  -0.504124 1.348452 5.131349
H  -1.349753 1.898618 4.709957
H  0.108699 0.941844 4.322427
H  -0.875505 0.530407 5.754922
C  -1.615868 5.586746 10.217217
H  -2.065933 4.719533 10.708028
H  -1.277943 6.299784 10.973929
H  -2.356323 6.065039 9.570529
C  5.970469 3.186471 5.328696
H  6.458025 2.31081 5.765824
H  5.708383 2.976981 4.288065
H  6.650136 4.041869 5.369668
elementType: O C F Co N H
totalener: -2833.53372825658380 hartree
nucrepener: 2717.03233689377657 hartree
electener: -5550.50757994807282 hartree
oneelecener: -9333.55772924771372 hartree
twoeener: 3783.05014929964045 hartree
cpcmener: -0.05848181608394 hartree
kineticenergy: 2825.61546839020593 hartree
exchangeener: -180.107338079578 hartree
correlationener: -8.866931660814 hartree
xcener: -188.974269740392 hartree
s2: 3.758183
energy: -7552.8939 -895.1959 -776.7463 -776.5828 -776.2449 -672.7653 -672.7571 -672.7556 -672.5768 -672.5708 -672.5695 -520.5214 -520.5098 -520.3488 -519.9923 -390.5301 -390.4634 -390.3569 -283.9160 -283.6119 -280.6218 -280.3606 -279.0884 -279.0282 -278.8979 -277.9538 -277.9330 -277.8895 -104.3267 -68.9628 -68.6467 -67.9738 -35.8873 -35.6659 -33.5951 -33.5558 -33.3826 -33.3463 -29.7020 -29.1507 -27.1084 -26.9621 -25.7912 -25.7111 -25.6089 -21.2464 -21.2143 -21.1533 -20.2901 -19.9423 -17.3983 -17.1121 -16.4069 -16.3742 -16.1915 -16.1573 -14.7105 -14.3801 -14.2628 -14.2173 -13.9933 -13.2564 -13.1627 -13.1604 -12.9861 -12.9755 -12.9256 -12.8619 -12.7374 -12.6950 -12.6567 -12.6272 -12.5945 -12.5740 -12.5460 -12.5019 -12.3216 -12.2821 -12.1197 -12.0396 -11.9051 -11.8538 -11.6551 -11.5458 -11.4265 -11.3640 -10.7438 -10.4147 -10.2634 -10.1180 -9.9839 -9.8360 -9.6659 -9.6266 -9.2063 -8.7913 -8.7550 -8.4642 -8.3345 -8.1152 -7.6489 -7.5738 -7.2403 -0.5848 -0.2543 -0.1946 -0.1411 0.0385 0.1914 0.2775 0.4414 0.4952 1.0226 1.1805 electronvolt
energy: -7552.8611 -893.4318 -775.1639 -775.0971 -774.9376 -672.7644 -672.7568 -672.7554 -672.5756 -672.5707 -672.5693 -520.4731 -520.4669 -520.2910 -519.9858 -390.4930 -390.4251 -390.3155 -283.9149 -283.6080 -280.6250 -280.3619 -279.0828 -279.0244 -278.8965 -277.9529 -277.9319 -277.8884 -100.3287 -64.3667 -64.3254 -64.2337 -35.8862 -35.6644 -33.5936 -33.5554 -33.3807 -33.3459 -29.6289 -29.0983 -27.0168 -26.8897 -25.7442 -25.6657 -25.5647 -21.2403 -21.2087 -21.1483 -20.2751 -19.9255 -17.3777 -17.0835 -16.4065 -16.3696 -16.1898 -16.1522 -14.5818 -14.2604 -14.1820 -14.1003 -13.9380 -13.1565 -13.1309 -13.0360 -12.9709 -12.9241 -12.7346 -12.6838 -12.6580 -12.6260 -12.5872 -12.5745 -12.5405 -12.5180 -12.4652 -12.2516 -12.2176 -12.1053 -12.0272 -12.0076 -11.8809 -11.8196 -11.5778 -11.5334 -11.3851 -11.2957 -10.2569 -10.0460 -9.9210 -9.8502 -9.7676 -9.6246 -8.8450 -8.5331 -8.3742 -8.2846 -8.1433 -7.6839 -7.1536 -7.1204 -2.5181 -1.3141 -0.6785 -0.5579 -0.1218 -0.0886 0.0594 0.1018 0.2592 0.4449 0.4773 electronvolt
chargesum: -0.0000000
charge: -0.452114 -0.472418 0.266957 -0.529132 -0.496246 0.271718 0.500051 0.489752 -0.192516 -0.186796 -0.193085 -0.185060 -0.178962 -0.185621 0.810329 -0.000778 -0.053300 0.015984 -0.038360 -0.006632 -0.128666 -0.122247 0.147177 0.147142 0.147616 -0.128604 0.145796 0.146327 0.145780 -0.124651 0.147504 0.146639 0.146416
charge: 0.020078 0.091485 -0.547618 0.094141 0.085732 -0.554290 -0.593317 -0.596214 0.161526 0.174675 0.160177 0.173344 0.185500 0.172717 -0.181196 -0.040167 0.201124 -0.030995 0.200153 -0.028566 0.201155 0.046166 0.057811 0.057634 0.058591 0.042865 0.056601 0.056560 0.056495 0.045171 0.057843 0.057463 0.057354
qa: -0.4521 -0.4724 0.2670 -0.5291 -0.4962 0.2717 0.5001 0.4898 -0.1925 -0.1868 -0.1931 -0.1851 -0.1790 -0.1856 0.8103 -0.0008 -0.0533 0.0160 -0.0384 -0.0066 -0.1287 -0.1222 0.1472 0.1471 0.1476 -0.1286 0.1458 0.1463 0.1458 -0.1247 0.1475 0.1466 0.1464
va: 2.0209 1.9664 4.1946 1.9157 1.9588 4.2940 4.4318 4.4725 1.0963 1.1143 1.0942 1.1109 1.1250 1.1099 4.5468 3.6907 3.1554 3.6657 3.1634 3.7443 3.1286 3.8272 0.9876 0.9876 0.9880 3.8244 0.9883 0.9875 0.9874 3.8269 0.9875 0.9875 0.9876
dispersion: -0.055323714 hartree
energy: -2833.589051970398 hartree
dipole: -12.441508148 10.498891730 -1.942616418 -12.299667763 10.652718744 -1.646949019 -15.740603627 11.615078290 -4.125525337
dipolemethod: SCF
magnitude: 4.848315061 au
magnitude: 12.323437524 debye
