program: Orca
programVersion: 6.0.1
elementType: O O C O O C C C F F F F F F Co C N C N C N C H H H C H H H C H H H
charge: 0
multiplicity: 4
keywords: TPSS D3BJ TightOpt Freq def2-TZVPP def2/J RIJCOSX TightSCF defgrid3 CPCM(Acetonitrile)
frequency: 0.00 0.00 0.00 0.00 0.00 0.00 14.29 19.74 19.88 21.85 23.16 25.25 28.02 30.76 33.80 35.59 40.72 49.10 49.18 72.37 79.91 86.74 91.10 125.89 128.74 136.79 154.75 157.61 172.80 185.11 187.15 195.03 221.72 238.28 254.57 262.29 266.02 281.63 295.33 388.93 394.06 398.53 400.44 403.15 405.58 408.78 412.73 422.83 471.08 492.65 495.01 569.53 582.98 690.24 697.70 764.57 768.61 800.31 823.53 933.67 935.61 938.70 1037.48 1038.16 1038.84 1040.04 1040.81 1041.10 1041.58 1053.65 1085.98 1095.71 1142.78 1157.76 1343.01 1380.50 1381.98 1384.32 1426.24 1433.91 1435.86 1436.01 1436.49 1437.16 1437.43 1593.91 1661.86 2311.69 2314.87 2317.36 3019.16 3019.98 3020.03 3096.13 3097.56 3097.72 3097.82 3098.09 3098.28
frequency: 14.29 19.74 19.88 21.85 23.16 25.25 28.02 30.76 33.80 35.59 40.72 49.10 49.18 72.37 79.91 86.74 91.10 125.89 128.74 136.79 154.75 157.61 172.80 185.11 187.15 195.03 221.72 238.28 254.57 262.29 266.02 281.63 295.33 388.93 394.06 398.53 400.44 403.15 405.58 408.78 412.73 422.83 471.08 492.65 495.01 569.53 582.98 690.24 697.70 764.57 768.61 800.31 823.53 933.67 935.61 938.70 1037.48 1038.16 1038.84 1040.04 1040.81 1041.10 1041.58 1053.65 1085.98 1095.71 1142.78 1157.76 1343.01 1380.50 1381.98 1384.32 1426.24 1433.91 1435.86 1436.01 1436.49 1437.16 1437.43 1593.91 1661.86 2311.69 2314.87 2317.36 3019.16 3019.98 3020.03 3096.13 3097.56 3097.72 3097.82 3098.09 3098.28
formula: C10H9CoF6N3O4
InChI: InChI=1/2C2F3O2.3C2H3N.Co/c2*3-2(4,5)1(6)7;3*1-2-3;/h;;3*1H3;/q;-1;;;;+1/rC8H9CoF3N3O2.C2F3O2/c1-4-13-9(14-5-2,15-6-3)17-7(16)8(10,11)12;3-2(4,5)1(6)7/h1-3H3;
33 atoms
O  0.947278 1.721101 9.698884
O  3.210303 6.024729 8.383272
C  2.658959 6.603245 7.415853
O  2.723168 3.095648 9.300169
O  1.848599 6.049564 6.62106
C  2.041145 2.224493 9.946728
C  2.788739 1.777774 11.247517
C  2.975795 8.096484 7.149618
F  4.021984 1.272745 10.969105
F  2.116911 0.826743 11.935651
F  2.97186 2.829045 12.09472
F  1.842107 8.844269 7.172989
F  3.825439 8.619323 8.058964
F  3.53974 8.257349 5.923844
Co 2.09806 4.187011 7.729374
C  -0.484069 5.155311 9.420318
N  0.417862 4.805488 8.788537
C  4.766944 3.489835 6.076932
N  3.808094 3.732125 6.674717
C  0.297487 2.240976 5.943639
N  0.935419 2.947897 6.598592
C  -0.504124 1.348452 5.131349
H  -1.349753 1.898618 4.709957
H  0.108699 0.941844 4.322427
H  -0.875505 0.530407 5.754922
C  -1.615868 5.586746 10.217217
H  -2.065933 4.719533 10.708028
H  -1.277943 6.299784 10.973929
H  -2.356323 6.065039 9.570529
C  5.970469 3.186471 5.328696
H  6.458025 2.31081 5.765824
H  5.708383 2.976981 4.288065
H  6.650136 4.041869 5.369668
totalener: -2834.46281390845979 hartree
nucrepener: 2735.82252049153885 hartree
electener: -5570.23162358804620 hartree
oneelecener: -9371.16245218025506 hartree
twoeener: 3800.93082859220931 hartree
cpcmener: -0.05371081195273 hartree
kineticenergy: 2826.80677682068017 hartree
exchangeener: -227.898875063114 hartree
correlationener: -7.236812956671 hartree
xcener: -235.135688019785 hartree
s2: 3.758356
dispersion: -0.042026313 hartree
s2: 3.758209
dispersion: -0.041917286 hartree
s2: 3.757601
dispersion: -0.041562279 hartree
s2: 3.757347
dispersion: -0.041457793 hartree
s2: 3.757229
dispersion: -0.041427317 hartree
s2: 3.757231
dispersion: -0.041437706 hartree
s2: 3.757257
dispersion: -0.041468930 hartree
s2: 3.757279
dispersion: -0.041494123 hartree
s2: 3.757291
dispersion: -0.041508780 hartree
s2: 3.757298
dispersion: -0.041505360 hartree
s2: 3.757300
dispersion: -0.041488732 hartree
s2: 3.757310
dispersion: -0.041477015 hartree
s2: 3.757339
dispersion: -0.041451347 hartree
s2: 3.757337
dispersion: -0.041460516 hartree
s2: 3.757341
dispersion: -0.041475722 hartree
s2: 3.757344
dispersion: -0.041485857 hartree
s2: 3.757350
dispersion: -0.041499499 hartree
s2: 3.757357
dispersion: -0.041512948 hartree
s2: 3.757359
dispersion: -0.041513859 hartree
s2: 3.757365
dispersion: -0.041519095 hartree
dispersion: -0.041518838 hartree
s2: 3.757366
dispersion: -0.041519568 hartree
dispersion: -0.041519344 hartree
dispersion: -0.041518970 hartree
elementType: O C F Co N H
energy: -7529.3742 -884.3421 -766.2984 -766.1511 -765.8457 -665.2724 -665.2589 -665.2575 -665.0847 -665.0705 -665.0701 -514.0182 -513.9996 -513.8887 -513.4002 -384.6691 -384.6133 -384.5105 -278.5597 -278.2526 -275.3251 -275.0575 -273.8118 -273.7699 -273.6435 -272.9943 -272.9785 -272.9352 -100.1614 -65.2130 -64.9195 -64.3122 -33.6235 -33.4019 -31.4127 -31.3713 -31.2004 -31.1615 -27.7821 -27.2354 -25.2927 -25.1307 -23.9845 -23.9136 -23.8130 -19.7673 -19.7421 -19.6824 -18.6158 -18.2624 -15.7807 -15.5021 -14.7915 -14.7555 -14.5764 -14.5397 -13.4406 -13.1517 -13.0670 -12.7800 -12.5489 -11.8934 -11.6210 -11.5937 -11.5613 -11.5344 -11.5116 -11.5028 -11.4788 -11.4525 -11.3802 -11.3245 -11.3077 -11.2722 -11.2321 -11.1630 -10.8868 -10.7653 -10.6477 -10.3806 -10.3417 -10.2160 -10.1615 -9.9686 -9.8636 -9.6914 -9.3401 -9.1454 -8.9914 -8.9199 -8.8583 -8.6786 -8.4709 -8.1341 -7.8028 -7.3827 -7.2488 -6.9775 -6.7570 -6.6644 -6.3461 -5.8965 -5.6198 -1.3628 -1.0246 -0.9443 -0.8640 -0.7327 -0.5845 -0.5010 -0.3513 0.2273 0.7598 0.9167 electronvolt
energy: -7529.3546 -882.9888 -765.1100 -765.0328 -764.8550 -665.2711 -665.2585 -665.2571 -665.0829 -665.0704 -665.0698 -513.9618 -513.9483 -513.8207 -513.3894 -384.6349 -384.5777 -384.4711 -278.5579 -278.2475 -275.3285 -275.0588 -273.8049 -273.7657 -273.6422 -272.9930 -272.9770 -272.9336 -96.8406 -61.6145 -61.5438 -61.3761 -33.6221 -33.4000 -31.4108 -31.3706 -31.1981 -31.1609 -27.7074 -27.1778 -25.1997 -25.0561 -23.9448 -23.8762 -23.7767 -19.7610 -19.7362 -19.6770 -18.6002 -18.2445 -15.7618 -15.4774 -14.7906 -14.7509 -14.5737 -14.5342 -13.3525 -13.0939 -13.0286 -12.6980 -12.4992 -11.7452 -11.5877 -11.5555 -11.5421 -11.5194 -11.4966 -11.4834 -11.4528 -11.4446 -11.3026 -11.2714 -11.2359 -11.2097 -11.0985 -10.9041 -10.8315 -10.6405 -10.5791 -10.3728 -10.3074 -10.2096 -10.1320 -9.9217 -9.8621 -9.6897 -9.1950 -9.0313 -8.9042 -8.8546 -8.7801 -8.6447 -7.6923 -7.3801 -7.3415 -7.2095 -7.0252 -6.4153 -5.5808 -5.4770 -4.0576 -2.8092 -2.2315 -1.3361 -0.9329 -0.8440 -0.7316 -0.6953 -0.5198 -0.4021 -0.3160 electronvolt
chargesum: -0.0000000
charge: -0.429733 -0.431487 0.293916 -0.490312 -0.450880 0.267653 0.403427 0.383194 -0.163988 -0.158330 -0.164433 -0.156102 -0.150420 -0.156633 0.692241 -0.126430 0.065108 -0.113202 0.074413 -0.135980 -0.009200 -0.023705 0.115564 0.115487 0.116016 -0.029135 0.113782 0.114610 0.114224 -0.025889 0.116110 0.115226 0.114889
charge: 0.038164 0.115372 -0.564134 0.119044 0.111606 -0.569020 -0.622619 -0.625444 0.171449 0.184681 0.170233 0.183642 0.195506 0.183044 -0.220918 -0.049324 0.204774 -0.040514 0.203200 -0.039211 0.204506 0.052154 0.055100 0.054949 0.056018 0.049134 0.054000 0.053988 0.054004 0.051524 0.055356 0.054960 0.054775
qa: -0.4297 -0.4315 0.2939 -0.4903 -0.4509 0.2677 0.4034 0.3832 -0.1640 -0.1583 -0.1644 -0.1561 -0.1504 -0.1566 0.6922 -0.1264 0.0651 -0.1132 0.0744 -0.1360 -0.0092 -0.0237 0.1156 0.1155 0.1160 -0.0291 0.1138 0.1146 0.1142 -0.0259 0.1161 0.1152 0.1149
va: 2.0524 2.0177 4.1324 1.9751 2.0131 4.2877 4.5162 4.5565 1.1345 1.1539 1.1326 1.1499 1.1645 1.1489 4.7056 3.7956 3.1088 3.7716 3.1142 3.8405 3.0754 3.9088 1.0036 1.0037 1.0041 3.9071 1.0045 1.0036 1.0035 3.9088 1.0036 1.0036 1.0036
dispersion: -0.041519559 hartree
energy: -2834.507151560172 hartree
dipole: -12.441507560 10.569847846 -1.871659714 -12.299666701 10.733910596 -1.565756105 -15.740605403 11.730804233 -4.009801169
dipolemethod: SCF
magnitude: 4.693954376 au
magnitude: 11.931083844 debye
temp: 298.15 k
press: 1.00 atm
zeropoint: 0.19085495 hartree
thermalvibcorrection: 0.02836489 hartree
thermalrotcorrection: 0.00141627 hartree
thermaltrasncorrection: 0.00141627 hartree
thermaltotal: -2834.28509918 hartree
thermalcorr: 0.03119743 hartree
nonthermalcorr: 0.19085495 hartree
totalcorr: 0.22205238 hartree
thermalcorrenthalpy: 0.00094421 hartree
totalenthalpy: -2834.28415497 hartree
vibrat: 0.05510687 hartree
rotat: 0.01697938 hartree
transl: 0.02086306 hartree
total: 0.09425822 hartree
totalentropycorr: -0.09425822 hartree
gibbsenthalpy: -2834.37841319 hartree
gibbsminuselec: 0.12873837 hartree
