program: Orca
programVersion: 6.0.1
elementType: O O C O O C C C F F F F F F O H H Co O H H O H H C N C H H H
charge: 0
multiplicity: 4
keywords: b3lyp d3bj def2-TZVPP def2/J RIJCOSX TightSCF defgrid3 CPCM(Acetonitrile)
formula: C6H9CoF6NO7
InChI: InChI=1/2C2F3O2.C2H3N.Co.3H2O/c2*3-2(4,5)1(6)7;1-2-3;;;;/h;;1H3;;3*1H2/q2*-1;;+2;;;/rC6H9CoF6NO7/c1-2-14-7(17,18,19,20-3(15)5(8,9)10)21-4(16)6(11,12)13/h17-19H2,1H3
30 atoms
O  0.867278 0.925405 8.134162
O  4.014616 6.570467 6.004096
C  2.777545 6.499216 5.856776
O  2.82188 2.081879 8.26375
O  1.968693 5.602522 6.232215
C  2.057557 1.092871 8.465149
C  2.754881 -0.057282 9.255889
C  2.078797 7.662565 5.086787
F  3.858819 -0.501695 8.598355
F  1.949041 -1.122956 9.453872
F  3.163907 0.372974 10.479724
F  1.0737 8.207208 5.821836
F  2.926055 8.663345 4.761599
F  1.526802 7.208959 3.928108
O  0.426127 3.216863 6.917829
H  0.175142 3.110438 5.98645
H  0.422595 2.296008 7.322956
Co 2.450611 3.785435 7.153038
O  1.966596 4.705274 9.053166
H  1.397427 5.482821 8.928223
H  1.468404 4.114787 9.641807
O  4.413494 4.441808 7.498386
H  4.530044 4.698136 8.427669
H  4.433785 5.295936 6.96512
C  3.195514 2.544049 4.295023
N  2.923897 2.998404 5.322819
C  3.535644 1.977438 3.005205
H  3.408084 2.736933 2.229108
H  4.576224 1.641857 3.019602
H  2.881069 1.126961 2.796329
elementType: O C F H Co N
totalener: -2797.39495199833755 hartree
nucrepener: 2440.35410231291644 hartree
electener: -5237.70388839897987 hartree
oneelecener: -8735.94737212493783 hartree
twoeener: 3498.24348372595796 hartree
cpcmener: -0.04516794967263 hartree
kineticenergy: 2789.82962665624018 hartree
exchangeener: -172.868020592978 hartree
correlationener: -8.372866073708 hartree
xcener: -181.240886666686 hartree
s2: 3.756044
energy: -7552.6912 -894.9509 -776.5279 -776.2580 -776.0528 -672.7046 -672.6929 -672.6923 -672.6917 -672.6833 -672.6822 -521.4730 -520.9875 -520.9831 -520.5986 -520.5447 -520.4296 -520.3907 -390.5083 -283.8053 -283.7871 -280.7053 -280.6654 -279.0715 -277.9526 -104.1351 -68.8392 -68.2980 -67.8910 -35.8134 -35.8000 -33.5240 -33.5111 -33.4826 -33.4713 -29.5641 -29.5165 -28.4284 -27.9072 -27.9053 -27.2645 -27.2068 -25.7565 -21.2374 -20.1575 -20.1362 -17.3501 -17.3198 -16.3332 -16.3212 -16.3094 -16.2937 -15.2495 -15.0177 -14.9413 -14.5858 -14.3789 -14.1957 -13.3452 -13.1232 -13.0976 -13.0786 -13.0726 -12.9951 -12.8866 -12.6318 -12.6291 -12.4932 -12.4681 -12.3870 -12.1822 -12.0391 -12.0219 -11.9860 -11.9375 -11.6977 -11.6624 -11.5381 -11.4833 -11.4706 -11.0452 -10.2205 -10.0890 -9.9898 -9.8840 -9.6600 -9.5730 -9.0756 -8.7882 -8.5553 -8.4792 -8.1771 -8.0804 -8.0724 -7.6681 -7.2181 -0.5129 -0.4881 -0.0193 0.0573 0.2224 0.9268 1.5153 1.8822 2.2251 2.6875 2.9641 electronvolt
energy: -7552.6587 -893.1792 -774.9241 -774.8063 -774.7151 -672.7035 -672.6923 -672.6919 -672.6919 -672.6835 -672.6821 -521.4371 -520.9402 -520.9368 -520.5534 -520.5007 -520.4294 -520.3913 -390.4704 -283.8022 -283.7840 -280.7057 -280.6657 -279.0692 -277.9515 -100.1133 -64.1593 -64.0902 -64.0430 -35.8121 -35.7989 -33.5224 -33.5096 -33.4826 -33.4712 -29.5286 -29.4835 -28.3650 -27.8180 -27.8145 -27.2180 -27.1624 -25.7127 -21.2324 -20.1430 -20.1231 -17.3258 -17.3019 -16.3322 -16.3202 -16.3041 -16.2895 -15.2180 -14.9628 -14.9116 -14.4810 -14.2380 -14.1466 -13.2812 -13.1016 -13.0932 -13.0714 -13.0103 -12.8518 -12.6286 -12.6143 -12.5413 -12.3984 -12.3731 -12.1318 -12.0504 -12.0205 -12.0053 -11.9482 -11.6630 -11.6043 -11.5084 -11.4825 -11.4734 -11.4492 -10.1551 -10.0189 -9.8612 -9.6790 -9.4142 -8.7656 -8.5800 -8.4781 -8.3958 -8.2409 -8.0707 -7.1057 -6.9230 -2.1584 -0.8870 -0.7296 -0.4022 -0.3768 0.0846 0.1476 0.2585 0.9433 1.5346 1.9428 electronvolt
chargesum: 0.0000000
charge: -0.457950 -0.461272 0.276690 -0.484620 -0.485084 0.283331 0.506980 0.509032 -0.188127 -0.181687 -0.188485 -0.188210 -0.182279 -0.190096 -0.434405 0.249387 0.245571 0.883498 -0.372818 0.256975 0.260475 -0.437098 0.245098 0.247984 0.014851 -0.044597 -0.125019 0.147290 0.147722 0.146862
charge: 0.069758 0.067284 -0.535041 0.114327 0.109752 -0.531850 -0.594655 -0.594305 0.168354 0.181302 0.167432 0.168481 0.180398 0.165641 0.375561 -0.077730 -0.150335 -0.110858 0.413627 -0.062543 -0.061721 0.376862 -0.078133 -0.149156 -0.028865 0.197290 0.045686 0.057701 0.058156 0.057580
qa: -0.4579 -0.4613 0.2767 -0.4846 -0.4851 0.2833 0.5070 0.5090 -0.1881 -0.1817 -0.1885 -0.1882 -0.1823 -0.1901 -0.4344 0.2494 0.2456 0.8835 -0.3728 0.2570 0.2605 -0.4371 0.2451 0.2480 0.0149 -0.0446 -0.1250 0.1473 0.1477 0.1469
va: 2.0284 2.0175 4.2723 1.9581 1.9449 4.2603 4.4398 4.4421 1.1040 1.1217 1.1034 1.1044 1.1205 1.1012 2.0570 1.0020 1.0737 4.4734 2.1130 0.9931 0.9927 2.0647 1.0049 1.0733 3.6856 3.1404 3.8307 0.9873 0.9872 0.9876
dispersion: -0.049242010 hartree
energy: -2797.444194008331 hartree
dipole: 1.401147872 -1.714994109 -0.313846237 -3.574640423 2.875487403 -0.699153020 -8.950122591 7.219510065 -1.730612526
dipolemethod: SCF
magnitude: 1.892705503 au
magnitude: 4.810875063 debye
