program: Orca
programVersion: 6.0.1
elementType: O O C O O C C C F F F F F F O H H Co O H H O H H C N C H H H
charge: 0
multiplicity: 4
keywords: TPSS D3BJ TightOpt Freq def2-TZVPP def2/J RIJCOSX TightSCF defgrid3 CPCM(Acetonitrile)
frequency: 0.00 0.00 0.00 0.00 0.00 0.00 10.49 12.44 14.41 16.09 31.14 36.01 38.71 40.61 52.67 59.51 90.56 102.90 107.01 123.41 125.64 141.04 147.19 153.83 163.76 178.34 204.81 215.29 224.56 229.49 260.33 263.53 268.53 280.57 297.79 317.98 334.72 398.26 400.90 423.10 424.75 439.10 448.83 450.85 455.19 458.10 493.44 493.85 560.68 580.20 582.07 606.99 620.35 688.88 690.02 766.11 767.02 792.33 795.17 935.19 944.11 966.87 1037.07 1038.98 1047.08 1048.64 1093.17 1093.91 1150.28 1153.09 1380.76 1386.91 1386.96 1435.06 1436.79 1594.40 1598.67 1603.66 1628.01 1634.98 2309.82 3006.77 3019.40 3022.67 3096.90 3097.46 3679.77 3720.44 3729.00 3762.60
frequency: 10.49 12.44 14.41 16.09 31.14 36.01 38.71 40.61 52.67 59.51 90.56 102.90 107.01 123.41 125.64 141.04 147.19 153.83 163.76 178.34 204.81 215.29 224.56 229.49 260.33 263.53 268.53 280.57 297.79 317.98 334.72 398.26 400.90 423.10 424.75 439.10 448.83 450.85 455.19 458.10 493.44 493.85 560.68 580.20 582.07 606.99 620.35 688.88 690.02 766.11 767.02 792.33 795.17 935.19 944.11 966.87 1037.07 1038.98 1047.08 1048.64 1093.17 1093.91 1150.28 1153.09 1380.76 1386.91 1386.96 1435.06 1436.79 1594.40 1598.67 1603.66 1628.01 1634.98 2309.82 3006.77 3019.40 3022.67 3096.90 3097.46 3679.77 3720.44 3729.00 3762.60
formula: C6H9CoF6NO7
InChI: InChI=1/2C2F3O2.C2H3N.Co.3H2O/c2*3-2(4,5)1(6)7;1-2-3;;;;/h;;1H3;;3*1H2/q2*-1;;+2;;;/rC6H9CoF6NO7/c1-2-14-7(17,18,19,20-3(15)5(8,9)10)21-4(16)6(11,12)13/h17-19H2,1H3
30 atoms
O  0.867278 0.925405 8.134162
O  4.014616 6.570467 6.004096
C  2.777545 6.499216 5.856776
O  2.82188 2.081879 8.26375
O  1.968693 5.602522 6.232215
C  2.057557 1.092871 8.465149
C  2.754881 -0.057282 9.255889
C  2.078797 7.662565 5.086787
F  3.858819 -0.501695 8.598355
F  1.949041 -1.122956 9.453872
F  3.163907 0.372974 10.479724
F  1.0737 8.207208 5.821836
F  2.926055 8.663345 4.761599
F  1.526802 7.208959 3.928108
O  0.426127 3.216863 6.917829
H  0.175142 3.110438 5.98645
H  0.422595 2.296008 7.322956
Co 2.450611 3.785435 7.153038
O  1.966596 4.705274 9.053166
H  1.397427 5.482821 8.928223
H  1.468404 4.114787 9.641807
O  4.413494 4.441808 7.498386
H  4.530044 4.698136 8.427669
H  4.433785 5.295936 6.96512
C  3.195514 2.544049 4.295023
N  2.923897 2.998404 5.322819
C  3.535644 1.977438 3.005205
H  3.408084 2.736933 2.229108
H  4.576224 1.641857 3.019602
H  2.881069 1.126961 2.796329
totalener: -2798.23577407270250 hartree
nucrepener: 2465.71503492632337 hartree
electener: -5263.90923032511910 hartree
oneelecener: -8786.74641870987398 hartree
twoeener: 3522.83718838475488 hartree
cpcmener: -0.04157867390695 hartree
kineticenergy: 2790.86747008459315 hartree
exchangeener: -218.645328777839 hartree
correlationener: -6.817374692569 hartree
xcener: -225.462703470407 hartree
s2: 3.756076
dispersion: -0.037810019 hartree
s2: 3.755974
dispersion: -0.037666999 hartree
s2: 3.755402
dispersion: -0.036997060 hartree
s2: 3.755381
dispersion: -0.037105558 hartree
s2: 3.755403
dispersion: -0.037165041 hartree
s2: 3.755361
dispersion: -0.037075680 hartree
s2: 3.755350
dispersion: -0.037050146 hartree
s2: 3.755352
dispersion: -0.037042048 hartree
s2: 3.755367
dispersion: -0.037026662 hartree
s2: 3.755375
dispersion: -0.037016738 hartree
s2: 3.755383
dispersion: -0.037008639 hartree
s2: 3.755385
dispersion: -0.037001684 hartree
dispersion: -0.036998372 hartree
dispersion: -0.036990093 hartree
s2: 3.755388
dispersion: -0.036980349 hartree
s2: 3.755392
dispersion: -0.036975814 hartree
s2: 3.755398
dispersion: -0.036975285 hartree
dispersion: -0.036977141 hartree
s2: 3.755405
dispersion: -0.036980008 hartree
s2: 3.755408
dispersion: -0.036982120 hartree
s2: 3.755409
dispersion: -0.036984074 hartree
s2: 3.755410
dispersion: -0.036985477 hartree
dispersion: -0.036985317 hartree
dispersion: -0.036985967 hartree
dispersion: -0.036985963 hartree
dispersion: -0.036985562 hartree
dispersion: -0.036985626 hartree
dispersion: -0.036986569 hartree
dispersion: -0.036987071 hartree
elementType: O C F H Co N
energy: -7529.1202 -884.0461 -766.0246 -765.7862 -765.5930 -665.2002 -665.1869 -665.1822 -665.1811 -665.1729 -665.1703 -514.9306 -514.4679 -514.4575 -514.0669 -514.0058 -513.8085 -513.7675 -384.6303 -278.4288 -278.4091 -275.3549 -275.3134 -273.7732 -272.9856 -99.9344 -65.0469 -64.5599 -64.1747 -33.5375 -33.5233 -31.3303 -31.3163 -31.2867 -31.2746 -27.6031 -27.5521 -26.6567 -26.1446 -26.1370 -25.3893 -25.3316 -23.9315 -19.7486 -18.4621 -18.4389 -15.7191 -15.6897 -14.7060 -14.6932 -14.6808 -14.6639 -13.9541 -13.6764 -13.6106 -13.2550 -12.9505 -12.7343 -11.9503 -11.6185 -11.5457 -11.5217 -11.5033 -11.4252 -11.3998 -11.3043 -11.2786 -11.0759 -10.9749 -10.8492 -10.7557 -10.4853 -10.4108 -10.3507 -10.3138 -10.3001 -10.1151 -10.0633 -9.7954 -9.7857 -9.4030 -9.0361 -8.8674 -8.5485 -8.2998 -8.2431 -7.8394 -7.5564 -7.3983 -7.2957 -6.9267 -6.8325 -6.4757 -6.3522 -5.7907 -5.5245 -1.2605 -1.2237 -0.7466 -0.6874 -0.1090 0.6381 1.1515 1.5485 1.9212 2.2982 2.4384 electronvolt
energy: -7529.1008 -882.6778 -764.8110 -764.6825 -764.5764 -665.1986 -665.1855 -665.1821 -665.1813 -665.1730 -665.1702 -514.8932 -514.4163 -514.4070 -514.0175 -513.9580 -513.8072 -513.7672 -384.5949 -278.4247 -278.4050 -275.3553 -275.3139 -273.7714 -272.9839 -96.5659 -61.3509 -61.2292 -61.1407 -33.5360 -33.5218 -31.3283 -31.3145 -31.2867 -31.2745 -27.5677 -27.5194 -26.6002 -26.0598 -26.0540 -25.3447 -25.2897 -23.8960 -19.7435 -18.4478 -18.4258 -15.7001 -15.6745 -14.7044 -14.6916 -14.6753 -14.6595 -13.9270 -13.6361 -13.5823 -13.1934 -12.8579 -12.6917 -11.8814 -11.5766 -11.5199 -11.5109 -11.4250 -11.4019 -11.3262 -11.2737 -11.1799 -10.9999 -10.9567 -10.7189 -10.5642 -10.4606 -10.3471 -10.3269 -10.2379 -10.1774 -10.0907 -10.0505 -9.7945 -9.7849 -9.0491 -8.9659 -8.5754 -8.4083 -8.1520 -7.5724 -7.4485 -7.3702 -7.1824 -6.9789 -6.8189 -5.3649 -5.2670 -3.7222 -2.3665 -2.1551 -1.2273 -1.1672 -0.6682 -0.6238 -0.0652 0.6505 1.1789 1.5894 electronvolt
chargesum: -0.0000000
charge: -0.431609 -0.434705 0.275172 -0.451893 -0.450970 0.282013 0.410752 0.412594 -0.159946 -0.153551 -0.160232 -0.160096 -0.154243 -0.161809 -0.430878 0.260646 0.247001 0.760427 -0.382126 0.268710 0.272170 -0.435465 0.255520 0.249960 -0.117353 0.072075 -0.028358 0.115305 0.115919 0.114970
charge: 0.085784 0.083164 -0.553319 0.133735 0.129060 -0.550110 -0.624180 -0.623855 0.178086 0.190930 0.177150 0.178129 0.189957 0.175372 0.386684 -0.076781 -0.153192 -0.157761 0.420452 -0.061668 -0.060973 0.388534 -0.077474 -0.151927 -0.041090 0.199305 0.051107 0.054834 0.055362 0.054686
qa: -0.4316 -0.4347 0.2752 -0.4519 -0.4510 0.2820 0.4108 0.4126 -0.1599 -0.1536 -0.1602 -0.1601 -0.1542 -0.1618 -0.4309 0.2606 0.2470 0.7604 -0.3821 0.2687 0.2722 -0.4355 0.2555 0.2500 -0.1174 0.0721 -0.0284 0.1153 0.1159 0.1150
va: 2.0708 2.0594 4.2583 2.0165 2.0033 4.2461 4.5289 4.5303 1.1420 1.1606 1.1413 1.1422 1.1593 1.1392 2.0640 0.9912 1.0744 4.6004 2.1131 0.9821 0.9821 2.0718 0.9947 1.0736 3.7942 3.0933 3.9145 1.0035 1.0032 1.0037
dispersion: -0.036986820 hartree
energy: -2798.275811439703 hartree
dipole: 1.401147413 -1.727622569 -0.326475156 -3.574639916 2.924448940 -0.650190977 -8.950120859 7.340545853 -1.609575007
dipolemethod: SCF
magnitude: 1.766370866 au
magnitude: 4.489757934 debye
temp: 298.15 k
press: 1.00 atm
zeropoint: 0.17295610 hartree
thermalvibcorrection: 0.02544268 hartree
thermalrotcorrection: 0.00141627 hartree
thermaltrasncorrection: 0.00141627 hartree
thermaltotal: -2798.07458011 hartree
thermalcorr: 0.02827522 hartree
nonthermalcorr: 0.17295610 hartree
totalcorr: 0.20123133 hartree
thermalcorrenthalpy: 0.00094421 hartree
totalenthalpy: -2798.07363591 hartree
vibrat: 0.04869300 hartree
rotat: 0.01668791 hartree
transl: 0.02076217 hartree
total: 0.08745200 hartree
totalentropycorr: -0.08745200 hartree
gibbsenthalpy: -2798.16108790 hartree
gibbsminuselec: 0.11472353 hartree
