program: Orca
programVersion: 6.0.1
elementType: O O C O O C C C F F F F F F O H H O H H O H H Co
charge: 0
multiplicity: 4
keywords: b3lyp d3bj def2-TZVPP def2/J RIJCOSX TightSCF defgrid3 CPCM(Acetonitrile)
formula: C4H6CoF6O7
InChI: InChI=1/2C2F3O2.Co.3H2O/c2*3-2(4,5)1(6)7;;;;/h;;;3*1H2/q2*-1;+2;;;/rC4H6CoF6O7/c6-3(7,8)1(12)17-5(14,15,16)18-2(13)4(9,10)11/h14-16H2
24 atoms
O  1.439311 0.671972 7.568007
O  3.906986 6.524563 6.153997
C  2.67491 6.564411 5.994443
O  2.551597 2.364887 8.599944
O  1.787731 5.709618 6.316365
C  2.187543 1.165416 8.438307
C  2.790975 0.193734 9.498714
C  2.068585 7.822703 5.302642
F  2.346762 -1.074082 9.363415
F  2.48794 0.597188 10.760398
F  4.1474 0.160582 9.402865
F  1.187216 8.449941 6.125078
F  3.008123 8.725323 4.952671
F  1.393203 7.478843 4.175202
O  0.804403 2.871227 6.376208
H  0.846338 2.887217 5.406199
H  0.961189 1.918268 6.69052
O  1.495408 4.797834 9.165539
H  0.731215 5.398377 9.16265
H  1.31726 4.122426 9.841672
O  4.139841 4.096981 7.114619
H  4.701971 3.886802 7.87717
H  4.306773 5.045118 6.828203
Co 2.123002 4.032262 7.365379
elementType: O C F H Co
totalener: -2664.64150975531948 hartree
nucrepener: 1968.76719392596715 hartree
electener: -4633.37115357233051 hartree
oneelecener: -7613.56070246992567 hartree
twoeener: 2980.18954889759561 hartree
cpcmener: -0.03755168480652 hartree
kineticenergy: 2657.73992958554663 hartree
exchangeener: -158.566387591629 hartree
correlationener: -7.508398797891 hartree
xcener: -166.074786389521 hartree
s2: 3.754590
energy: -7553.0489 -895.3110 -776.7628 -776.7324 -776.4285 -672.7769 -672.7654 -672.7650 -672.7332 -672.7227 -672.7217 -521.9713 -521.4465 -521.4100 -520.9181 -520.6380 -520.6366 -520.5222 -283.9171 -283.8461 -280.9243 -280.7676 -104.5058 -68.9636 -68.8910 -68.2978 -35.9005 -35.8467 -33.6079 -33.5638 -33.5566 -33.5150 -29.7902 -29.6528 -28.8775 -28.3202 -28.2413 -27.4999 -27.3191 -20.2832 -20.2012 -17.4869 -17.4034 -16.4173 -16.3997 -16.3660 -16.3446 -15.7632 -15.5119 -15.3567 -14.7360 -14.3101 -13.6030 -13.3488 -13.2372 -13.1709 -13.1279 -13.0755 -13.0053 -12.7572 -12.6361 -12.5536 -12.4295 -12.1514 -12.0843 -12.0678 -12.0125 -11.7980 -11.6977 -11.5533 -11.5137 -10.9988 -10.8209 -10.3990 -10.1254 -9.7631 -9.4724 -8.9968 -8.9553 -8.7136 -8.5488 -8.3736 -8.3067 -8.2021 -7.4112 -0.7123 -0.5579 -0.0867 1.0215 1.2851 2.1109 2.7271 2.9117 3.0842 3.2747 3.4649 electronvolt
energy: -7553.0153 -893.5634 -775.2567 -775.2442 -775.0875 -672.7758 -672.7654 -672.7650 -672.7322 -672.7228 -672.7217 -521.9260 -521.3960 -521.3597 -520.8731 -520.6376 -520.5974 -520.5232 -283.9142 -283.8434 -280.9240 -280.7685 -100.5285 -64.5890 -64.5462 -64.4158 -35.8993 -35.8457 -33.6063 -33.5637 -33.5551 -33.5151 -29.7524 -29.6237 -28.7925 -28.2212 -28.1410 -27.4508 -27.2799 -20.2681 -20.1886 -17.4622 -17.3845 -16.4161 -16.3933 -16.3652 -16.3398 -15.7194 -15.4580 -15.3106 -14.5962 -14.2585 -13.5130 -13.2274 -13.1752 -13.1265 -13.0689 -12.9906 -12.7514 -12.5055 -12.4747 -12.1828 -12.1542 -12.1028 -12.0551 -12.0224 -11.9239 -11.7509 -11.6510 -11.5517 -11.5113 -10.3747 -10.0782 -10.0666 -9.1011 -8.9210 -8.6843 -8.5539 -8.3851 -8.2819 -7.3955 -7.3474 -2.1190 -2.0384 -0.9951 -0.6556 -0.5225 0.0803 1.0658 1.3158 2.1211 2.7515 2.9275 electronvolt
chargesum: -0.0000000
charge: -0.452545 -0.442685 0.321253 -0.471421 -0.453752 0.309692 0.517919 0.510282 -0.180678 -0.187290 -0.188179 -0.185507 -0.178284 -0.184941 -0.442795 0.263864 0.262495 -0.383888 0.277034 0.270852 -0.428233 0.265432 0.261428 0.919948
charge: 0.081026 0.083068 -0.516203 0.102302 0.109653 -0.527993 -0.595256 -0.596943 0.182817 0.169889 0.168369 0.171567 0.186108 0.172287 0.395400 -0.065096 -0.150000 0.440549 -0.046541 -0.050099 0.402615 -0.064986 -0.137911 0.085381
qa: -0.4525 -0.4427 0.3213 -0.4714 -0.4538 0.3097 0.5179 0.5103 -0.1807 -0.1873 -0.1882 -0.1855 -0.1783 -0.1849 -0.4428 0.2639 0.2625 -0.3839 0.2770 0.2709 -0.4282 0.2654 0.2614 0.9199
va: 2.0367 2.0451 4.1935 1.9424 2.0024 4.2114 4.4329 4.4422 1.1230 1.1057 1.1043 1.1082 1.1272 1.1092 2.0997 0.9905 1.0641 2.1483 0.9789 0.9881 2.1044 0.9924 1.0556 4.4197
dispersion: -0.036930852 hartree
energy: -2664.678440607619 hartree
dipole: -0.645597464 -0.179927415 -0.825524879 -1.314118846 1.779823009 0.465704163 1.042725639 0.038989977 1.081715616
dipolemethod: SCF
magnitude: 1.438221252 au
magnitude: 3.655667901 debye
