program: Orca
programVersion: 6.0.1
elementType: O O C O O C C C F F F F F F Co C N C N C N C N C H H H C H H H C H H H C H H H
charge: 0
multiplicity: 4
keywords: b3lyp d3bj def2-TZVPP def2/J RIJCOSX TightSCF defgrid3 CPCM(Acetonitrile)
formula: C12H12CoF6N4O4
InChI: InChI=1/2C2F3O2.4C2H3N.Co/c2*3-2(4,5)1(6)7;4*1-2-3;/h;;4*1H3;/q2*-1;;;;;+2/rC12H12CoF6N4O4/c1-5-20-13(21-6-2,22-7-3,23-8-4,26-9(24)11(14,15)16)27-10(25)12(17,18)19/h1-4H3
39 atoms
O  0.763129 1.446336 9.229998
O  2.718449 7.259335 7.15691
C  2.221297 6.724277 6.165387
O  2.605655 2.010796 8.008112
O  1.961464 5.500929 5.907159
C  1.904319 1.290164 8.7874
C  2.685248 -0.001312 9.211781
C  1.807021 7.644188 4.964654
F  2.989073 -0.77567 8.13051
F  1.989272 -0.78306 10.070873
F  3.866131 0.301881 9.821821
F  0.471933 7.552436 4.704459
F  2.075886 8.952705 5.183938
F  2.456999 7.293201 3.818985
Co 2.27994 3.806174 7.037499
C  1.037936 5.130147 9.717654
N  1.499564 4.665154 8.766235
C  5.252462 4.730705 7.951789
N  4.185896 4.40821 7.646373
C  3.528988 2.446515 4.344549
N  3.076983 2.923684 5.29497
C  -0.645523 2.781253 6.050478
N  0.398674 3.1481 6.38213
C  -1.956949 2.314358 5.643879
H  -2.631603 3.168134 5.538033
H  -1.879305 1.790788 4.687358
H  -2.349753 1.63199 6.402593
C  0.458271 5.710724 10.913171
H  -0.113943 4.94759 11.447708
H  1.25498 6.088888 11.559229
H  -0.204749 6.533851 10.63344
C  6.587173 5.146983 8.336438
H  6.922526 4.553504 9.191144
H  7.272598 4.997959 7.49787
H  6.571704 6.205193 8.611317
C  4.095335 1.846913 3.151539
H  4.679575 2.595395 2.609595
H  4.744287 1.014322 3.436032
H  3.29002 1.478559 2.510511
elementType: O C F Co N H
totalener: -2966.27811107829075 hartree
nucrepener: 3192.94100502364108 hartree
electener: -6159.15089924397307 hartree
twoeener: 4305.57233652761442 hartree
cpcmener: -0.06822236601469 hartree
kineticenergy: 2957.69022388424492 hartree
exchangeener: -194.404810169756 hartree
correlationener: -9.728359189253 hartree
xcener: -204.133169359009 hartree
s2: 3.759081
energy: -7552.7081 -895.0197 -776.5524 -776.4555 -776.0313 -672.5181 -672.5130 -672.5116 -672.5062 -672.5003 -672.4999 -520.1194 -520.0900 -519.8309 -519.7504 -390.2918 -390.2905 -390.2750 -390.2699 -283.5152 -283.5029 -280.2142 -280.1835 -278.8416 -278.8318 -278.8081 -278.8025 -277.8791 -277.8708 -277.8636 -277.8567 -104.1504 -68.7540 -68.5702 -67.7216 -35.5948 -35.5785 -33.3145 -33.2996 -33.2800 -33.2637 -28.9611 -28.9239 -26.8014 -26.7487 -25.6018 -25.5419 -25.5263 -25.4925 -21.1374 -21.1241 -21.1143 -21.1068 -19.8393 -19.8208 -17.0202 -16.9654 -16.1231 -16.1076 -16.0864 -16.0710 -14.7275 -14.2118 -14.2108 -14.1729 -14.0702 -13.9015 -13.1449 -12.9178 -12.9042 -12.8690 -12.8558 -12.8138 -12.6185 -12.5777 -12.5614 -12.5497 -12.5461 -12.5170 -12.5142 -12.4991 -12.4696 -12.3715 -12.2498 -12.2190 -12.0446 -12.0273 -11.8342 -11.8111 -11.7201 -11.7052 -11.3493 -11.3267 -11.2884 -11.2352 -10.5910 -10.4879 -10.0720 -9.8568 -9.7221 -9.6683 -9.6593 -9.5443 -9.4375 -9.4323 -8.7769 -8.5816 -8.1173 -7.9781 -7.8198 -7.7241 -7.5282 -7.4562 -6.9733 -0.1190 -0.0907 -0.0755 -0.0588 0.1832 0.2050 0.3466 0.3676 0.4218 0.4622 0.7218 electronvolt
energy: -7552.6756 -893.2345 -774.9556 -774.9263 -774.7305 -672.5169 -672.5129 -672.5116 -672.5050 -672.5004 -672.5000 -520.0656 -520.0352 -519.8255 -519.7519 -390.2507 -390.2499 -390.2324 -390.2279 -283.5109 -283.4986 -280.2148 -280.1824 -278.8393 -278.8291 -278.8061 -278.8003 -277.8781 -277.8697 -277.8625 -277.8555 -100.1107 -64.1559 -64.0865 -64.0180 -35.5932 -35.5771 -33.3125 -33.2978 -33.2798 -33.2637 -28.9152 -28.8826 -26.7383 -26.6950 -25.5567 -25.4985 -25.4824 -25.4467 -21.1322 -21.1189 -21.1093 -21.1010 -19.8221 -19.8059 -16.9858 -16.9438 -16.1214 -16.1063 -16.0812 -16.0663 -14.6207 -14.1570 -14.1246 -14.0676 -13.8969 -13.8369 -12.9136 -12.9125 -12.9011 -12.8666 -12.8540 -12.5703 -12.5536 -12.5420 -12.5339 -12.5268 -12.5078 -12.4959 -12.4730 -12.3407 -12.2786 -12.1679 -12.1621 -11.9803 -11.9457 -11.8134 -11.7963 -11.7365 -11.6664 -11.6300 -11.3326 -11.3222 -11.2077 -11.2044 -10.2754 -9.8691 -9.7955 -9.7405 -9.6823 -9.6238 -9.6170 -9.4011 -8.3903 -8.1075 -8.0220 -7.9624 -7.5239 -7.4556 -6.9533 -6.8086 -2.3515 -0.8086 -0.4124 -0.0547 -0.0344 0.0027 0.1075 0.2053 0.2391 0.4179 0.4441 electronvolt
chargesum: -0.0000000
charge: -0.478163 -0.464413 0.280105 -0.519970 -0.527733 0.276041 0.505131 0.504405 -0.197604 -0.190043 -0.196782 -0.196394 -0.189740 -0.196325 0.717694 -0.009184 -0.088520 -0.001744 -0.084720 0.004410 -0.079106 -0.002837 -0.083500 -0.130203 0.144730 0.144730 0.144954 -0.132219 0.144559 0.145107 0.144812 -0.130047 0.144934 0.144981 0.145224 -0.128302 0.145315 0.145190 0.145224
charge: -0.006734 0.006493 -0.564197 0.101594 0.093277 -0.571752 -0.589880 -0.591208 0.154841 0.169933 0.156075 0.156549 0.170669 0.156642 -0.290678 -0.047766 0.204750 -0.046253 0.201386 -0.046821 0.195604 -0.048281 0.199914 0.041017 0.055884 0.055510 0.055883 0.041093 0.055760 0.055736 0.056034 0.041498 0.056039 0.055764 0.056130 0.041503 0.056008 0.056134 0.055850
qa: -0.4782 -0.4644 0.2801 -0.5200 -0.5277 0.2760 0.5051 0.5044 -0.1976 -0.1900 -0.1968 -0.1964 -0.1897 -0.1963 0.7177 -0.0092 -0.0885 -0.0017 -0.0847 0.0044 -0.0791 -0.0028 -0.0835 -0.1302 0.1447 0.1447 0.1450 -0.1322 0.1446 0.1451 0.1448 -0.1300 0.1449 0.1450 0.1452 -0.1283 0.1453 0.1452 0.1452
va: 1.9931 2.0069 4.2683 1.9103 1.9078 4.2780 4.4171 4.4265 1.0864 1.1087 1.0881 1.0881 1.1094 1.0882 4.6632 3.7045 3.1282 3.6900 3.1147 3.6752 3.0927 3.6886 3.1088 3.8262 0.9877 0.9876 0.9888 3.8259 0.9888 0.9876 0.9878 3.8264 0.9877 0.9876 0.9884 3.8273 0.9877 0.9878 0.9875
dispersion: -0.066112842 hartree
energy: -2966.344223920298 hartree
dipole: 0.058405315 0.651238672 0.709643987 -0.363532954 -0.245936219 -0.609469173 0.097463468 -1.420775993 -1.323312525
dipolemethod: SCF
magnitude: 1.620556479 au
magnitude: 4.119127217 debye
