program: Orca
programVersion: 6.0.0
elementType: O O C O O C C C F F F F F F O H H Cu C N C H H H
charge: 0
multiplicity: 2
keywords: TPSS D3BJ TightOpt Freq def2-TZVPP def2/J RIJCOSX TightSCF defgrid3 CPCM(Acetonitrile)
frequency: 0.00 0.00 0.00 0.00 0.00 0.00 -25.40 14.62 18.83 19.75 23.95 31.05 36.18 46.35 62.42 78.84 98.05 108.68 139.29 167.11 178.31 183.73 208.13 248.29 259.85 272.20 282.40 295.89 326.10 375.81 393.10 395.96 409.77 432.96 445.93 479.51 492.44 495.19 495.41 582.03 593.04 671.61 696.37 696.45 763.11 765.41 807.67 810.13 947.12 992.88 1036.51 1038.08 1051.64 1060.50 1096.45 1104.17 1142.13 1150.92 1344.88 1375.05 1379.87 1430.67 1432.20 1571.73 1638.22 1656.93 2332.73 2935.46 3020.56 3100.17 3100.34 3705.59
frequency: 14.62 18.83 19.75 23.95 31.05 36.18 46.35 62.42 78.84 98.05 108.68 139.29 167.11 178.31 183.73 208.13 248.29 259.85 272.20 282.40 295.89 326.10 375.81 393.10 395.96 409.77 432.96 445.93 479.51 492.44 495.19 495.41 582.03 593.04 671.61 696.37 696.45 763.11 765.41 807.67 810.13 947.12 992.88 1036.51 1038.08 1051.64 1060.50 1096.45 1104.17 1142.13 1150.92 1344.88 1375.05 1379.87 1430.67 1432.20 1571.73 1638.22 1656.93 2332.73 2935.46 3020.56 3100.17 3100.34 3705.59
formula: C6H5CuF6NO5
InChI: InChI=1/2C2F3O2.C2H3N.Cu.H2O/c2*3-2(4,5)1(6)7;1-2-3;;/h;;1H3;;1H2/q2*-1;;+2;/rC6H5CuF6NO5/c1-2-14-7(17,18-3(15)5(8,9)10)19-4(16)6(11,12)13/h17H2,1H3
24 atoms
O  1.110318 1.50982 9.488674
O  2.251774 2.719659 4.658114
C  3.454352 2.568285 4.869339
O  2.672883 1.441514 7.829573
O  4.106679 2.745144 5.960732
C  1.870317 0.945056 8.68716
C  1.90304 -0.615279 8.6762
C  4.3901 2.110961 3.706711
F  1.576675 -1.097897 7.451124
F  1.044423 -1.148704 9.567745
F  3.144785 -1.072827 8.976647
F  5.052101 0.968101 4.023397
F  3.707638 1.879951 2.566015
F  5.326869 3.058288 3.434973
O  1.857465 3.937883 8.984912
H  1.158885 4.564859 8.730883
H  1.402327 3.091062 9.298561
Cu 2.898209 3.336792 7.391409
C  3.215322 6.268009 6.407733
N  3.10388 5.191523 6.80784
C  3.35427 7.617429 5.904424
H  2.412292 8.154146 6.046003
H  4.153282 8.126045 6.450789
H  3.601776 7.580896 4.840005
totalener: -2902.94425678431662 hartree
nucrepener: 2055.82375477391770 hartree
electener: -4958.72080718961570 hartree
oneelecener: -8125.60174703095345 hartree
twoeener: 3166.88093984133775 hartree
cpcmener: -0.04720436861892 hartree
kineticenergy: 2895.67637536369148 hartree
exchangeener: -208.162048568766 hartree
correlationener: -6.277742112131 hartree
xcener: -214.439790680897 hartree
s2: 0.751546
dispersion: -0.028519754 hartree
dispersion: -0.028543599 hartree
s2: 0.751542
dispersion: -0.028620339 hartree
s2: 0.751545
dispersion: -0.028568185 hartree
dispersion: -0.028554330 hartree
dispersion: -0.028569889 hartree
dispersion: -0.028574759 hartree
s2: 0.751549
dispersion: -0.028602906 hartree
dispersion: -0.028611961 hartree
s2: 0.751551
dispersion: -0.028620272 hartree
dispersion: -0.028621740 hartree
dispersion: -0.028615377 hartree
s2: 0.751548
dispersion: -0.028610998 hartree
s2: 0.751547
dispersion: -0.028610514 hartree
dispersion: -0.028612656 hartree
dispersion: -0.028617115 hartree
dispersion: -0.028622191 hartree
dispersion: -0.028626733 hartree
dispersion: -0.028630202 hartree
dispersion: -0.028633088 hartree
dispersion: -0.028635474 hartree
s2: 0.751544
dispersion: -0.028636613 hartree
dispersion: -0.028637145 hartree
dispersion: -0.028636631 hartree
dispersion: -0.028637219 hartree
dispersion: -0.028640131 hartree
dispersion: -0.028640025 hartree
dispersion: -0.028640596 hartree
dispersion: -0.028641273 hartree
dispersion: -0.028642019 hartree
dispersion: -0.028643220 hartree
dispersion: -0.028642791 hartree
dispersion: -0.028639566 hartree
dispersion: -0.028641654 hartree
dispersion: -0.028642120 hartree
s2: 0.751543
dispersion: -0.028649665 hartree
dispersion: -0.028643467 hartree
dispersion: -0.028642992 hartree
elementType: O C F H Cu N
energy: -8767.3311 -1047.7096 -917.6604 -917.6529 -917.3866 -665.3356 -665.3123 -665.3104 -665.2487 -665.2304 -665.2241 -515.1076 -514.6713 -514.4389 -514.1870 -513.6995 -385.0515 -278.6418 -278.5156 -275.7182 -275.3398 -274.1942 -273.1210 -116.1506 -75.9739 -75.9422 -74.8422 -33.6994 -33.5948 -31.4847 -31.4366 -31.3855 -31.3388 -28.0489 -27.6829 -26.7014 -25.8543 -25.4688 -24.3333 -19.9509 -18.6883 -18.5259 -15.9759 -15.7550 -14.8583 -14.8498 -14.7587 -14.7291 -14.2033 -13.6912 -13.3314 -12.9229 -12.3401 -11.9869 -11.7198 -11.7055 -11.6783 -11.6071 -11.4497 -11.4181 -11.3837 -11.2425 -11.2105 -10.9783 -10.6851 -10.6459 -10.4737 -10.3730 -10.2883 -10.1608 -9.9136 -9.8372 -9.5699 -9.4067 -9.3520 -8.7364 -8.3818 -8.3050 -8.1664 -7.8483 -7.6371 -7.4933 -7.3000 -7.1867 -6.6882 -6.2763 -1.6106 -1.2810 -1.1368 -0.9611 -0.2497 0.8812 1.4149 1.7573 2.0196 2.3450 2.5405 electronvolt
energy: -8767.3258 -1047.3079 -917.2649 -917.2310 -917.2242 -665.3323 -665.3122 -665.3101 -665.2452 -665.2299 -665.2239 -515.0394 -514.5928 -514.3333 -514.1875 -513.6979 -385.0041 -278.6340 -278.5060 -275.7194 -275.3440 -274.1911 -273.1195 -115.2528 -74.7987 -74.7648 -74.5544 -33.6962 -33.5911 -31.4805 -31.4361 -31.3810 -31.3380 -27.9915 -27.5981 -26.5829 -25.7828 -25.3719 -24.2883 -19.9438 -18.6595 -18.4933 -15.9460 -15.7203 -14.8547 -14.8392 -14.7546 -14.7204 -14.1527 -13.5874 -13.2834 -12.8208 -12.2601 -11.8770 -11.7108 -11.7006 -11.6012 -11.4661 -11.4428 -11.4067 -11.3171 -11.2171 -11.0531 -10.9356 -10.6341 -10.5872 -10.4677 -10.3661 -10.2809 -10.1490 -9.9121 -9.8353 -9.4178 -9.3298 -9.1540 -8.4047 -8.1870 -8.0329 -7.8910 -7.4503 -7.2746 -7.2485 -7.2177 -7.1302 -6.5908 -4.7986 -1.6008 -1.2654 -1.1052 -0.9236 -0.2133 0.8923 1.4378 1.7472 2.0514 2.3596 electronvolt
chargesum: -0.0000000
charge: -0.391330 -0.420055 0.330380 -0.357435 -0.397505 0.291578 0.422854 0.407471 -0.152716 -0.146879 -0.153290 -0.155866 -0.150639 -0.157622 -0.364827 0.277298 0.258085 0.420240 -0.042663 0.135233 -0.012813 0.120111 0.120281 0.120108
charge: 0.122092 0.070713 -0.555517 0.150925 0.137348 -0.515405 -0.626500 -0.625274 0.187386 0.200437 0.186708 0.181780 0.195734 0.179566 0.422588 -0.054567 -0.144314 0.049936 -0.008359 0.207713 0.061286 0.058447 0.058745 0.058533
qa: -0.3913 -0.4201 0.3304 -0.3574 -0.3975 0.2916 0.4229 0.4075 -0.1527 -0.1469 -0.1533 -0.1559 -0.1506 -0.1576 -0.3648 0.2773 0.2581 0.4202 -0.0427 0.1352 -0.0128 0.1201 0.1203 0.1201
va: 2.1208 2.0662 4.1420 2.1431 2.0962 4.2062 4.5332 4.5397 1.1527 1.1732 1.1518 1.1472 1.1674 1.1440 2.2043 0.9765 1.0650 2.5480 3.6589 3.2095 3.9118 1.0037 1.0034 1.0036
dispersion: -0.028642641 hartree
energy: -2902.973490443392 hartree
dipole: -3.669416644 3.382808860 -0.286607785 23.618430797 -17.420149898 6.198280899 2.074715532 -1.172718728 0.901996804
dipolemethod: SCF
magnitude: 6.270121878 au
magnitude: 15.937383249 debye
temp: 298.15 k
press: 1.00 atm
zeropoint: 0.12426660 hartree
thermalvibcorrection: 0.01900480 hartree
thermalrotcorrection: 0.00141627 hartree
thermaltrasncorrection: 0.00141627 hartree
thermaltotal: -2902.82738649 hartree
thermalcorr: 0.02183735 hartree
nonthermalcorr: 0.12426660 hartree
totalcorr: 0.14610395 hartree
thermalcorrenthalpy: 0.00094421 hartree
totalenthalpy: -2902.82644228 hartree
vibrat: 0.03602617 hartree
rotat: 0.01648194 hartree
transl: 0.02064000 hartree
total: 0.07380257 hartree
totalentropycorr: -0.07380257 hartree
gibbsenthalpy: -2902.90024486 hartree
gibbsminuselec: 0.07324559 hartree
