program: Orca
programVersion: 6.0.0
elementType: O O C O O C C C F F F F F F O H H Cu C N C H H H C N C H H H
charge: 0
multiplicity: 2
keywords: TPSS D3BJ TightOpt Freq def2-TZVPP def2/J RIJCOSX TightSCF defgrid3 CPCM(Acetonitrile)
frequency: 0.00 0.00 0.00 0.00 0.00 0.00 11.66 13.69 18.49 21.05 21.85 24.36 28.36 35.19 36.88 46.66 48.95 75.98 86.08 96.51 104.05 109.66 150.87 166.06 166.60 171.35 195.74 199.76 205.79 229.64 243.54 267.85 272.24 291.66 308.04 308.76 391.04 392.58 405.05 405.72 407.29 408.85 465.25 480.79 493.46 495.05 548.32 582.03 587.29 687.31 690.17 734.84 764.50 764.76 779.25 826.57 855.32 941.33 942.97 1037.94 1037.99 1038.77 1038.87 1052.73 1053.50 1098.58 1099.39 1141.27 1149.47 1349.46 1350.85 1380.53 1380.99 1433.15 1433.84 1434.09 1435.04 1567.40 1626.95 1658.22 2328.90 2329.55 3020.68 3020.73 3098.77 3098.98 3100.29 3100.56 3354.52 3405.03
frequency: 11.66 13.69 18.49 21.05 21.85 24.36 28.36 35.19 36.88 46.66 48.95 75.98 86.08 96.51 104.05 109.66 150.87 166.06 166.60 171.35 195.74 199.76 205.79 229.64 243.54 267.85 272.24 291.66 308.04 308.76 391.04 392.58 405.05 405.72 407.29 408.85 465.25 480.79 493.46 495.05 548.32 582.03 587.29 687.31 690.17 734.84 764.50 764.76 779.25 826.57 855.32 941.33 942.97 1037.94 1037.99 1038.77 1038.87 1052.73 1053.50 1098.58 1099.39 1141.27 1149.47 1349.46 1350.85 1380.53 1380.99 1433.15 1433.84 1434.09 1435.04 1567.40 1626.95 1658.22 2328.90 2329.55 3020.68 3020.73 3098.77 3098.98 3100.29 3100.56 3354.52 3405.03
formula: C8H8CuF6N2O5
InChI: InChI=1/2C2F3O2.2C2H3N.Cu.H2O/c2*3-2(4,5)1(6)7;2*1-2-3;;/h;;2*1H3;;1H2/q2*-1;;;+2;/rC8H6CuF6N2O4.H2O/c1-3-16-9(17-4-2,20-5(18)7(10,11)12)21-6(19)8(13,14)15;/h1-2H3;1H2
30 atoms
O  1.073984 0.679257 7.267866
O  0.354711 4.68663 4.614275
C  1.193589 5.479433 5.057175
O  2.527136 2.134579 8.25649
O  1.944468 5.40109 6.087023
C  1.992809 0.996605 8.031474
C  2.664824 -0.125087 8.889029
C  1.438113 6.811641 4.275879
F  3.977633 -0.25945 8.563507
F  2.079123 -1.326774 8.709145
F  2.60441 0.163573 10.214278
F  2.704551 6.852522 3.782788
F  0.594132 6.955375 3.233591
F  1.281994 7.894319 5.079364
O  -0.005609 3.138795 6.822592
H  -0.055616 3.486264 5.899665
H  0.176825 2.170229 6.768292
Cu 2.090877 3.726251 7.148991
C  3.375686 2.31656 4.651808
N  2.945567 2.842158 5.584969
C  3.916155 1.659283 3.480501
H  4.311898 2.412143 2.793613
H  4.717432 0.979975 3.783373
H  3.122066 1.092816 2.986309
C  1.951567 5.433255 9.774848
N  2.047765 4.817182 8.80359
C  1.833169 6.205753 10.994155
H  2.337071 5.67735 11.807929
H  2.296446 7.185382 10.849689
H  0.775293 6.333267 11.239696
totalener: -3035.79060759270124 hartree
nucrepener: 2515.47817610526636 hartree
electener: -5551.23067335338601 hartree
oneelecener: -9223.61983510141727 hartree
twoeener: 3672.38916174803171 hartree
cpcmener: -0.03811034458278 hartree
kineticenergy: 3027.92720234953595 hartree
exchangeener: -226.316763090394 hartree
correlationener: -6.996028674951 hartree
xcener: -233.312791765345 hartree
s2: 0.751612
dispersion: -0.038432130 hartree
s2: 0.751615
dispersion: -0.038431740 hartree
dispersion: -0.038428357 hartree
dispersion: -0.038427064 hartree
dispersion: -0.038427969 hartree
dispersion: -0.038428402 hartree
s2: 0.751614
dispersion: -0.038423969 hartree
dispersion: -0.038428103 hartree
dispersion: -0.038427733 hartree
dispersion: -0.038428976 hartree
dispersion: -0.038429250 hartree
dispersion: -0.038429093 hartree
dispersion: -0.038429339 hartree
dispersion: -0.038430169 hartree
dispersion: -0.038432572 hartree
dispersion: -0.038431871 hartree
dispersion: -0.038430941 hartree
dispersion: -0.038430350 hartree
dispersion: -0.038429782 hartree
dispersion: -0.038429175 hartree
dispersion: -0.038429918 hartree
dispersion: -0.038430127 hartree
dispersion: -0.038430007 hartree
dispersion: -0.038429942 hartree
dispersion: -0.038429881 hartree
dispersion: -0.038430050 hartree
dispersion: -0.038430189 hartree
elementType: O C F H Cu N
energy: -8767.1548 -1047.5469 -917.5538 -917.4194 -917.2337 -665.2684 -665.2677 -665.2471 -665.2461 -665.2458 -665.2452 -514.4806 -514.4788 -514.0094 -513.8887 -513.8874 -384.8668 -384.8460 -278.5340 -278.5335 -275.4803 -275.4800 -273.9900 -273.9736 -273.0471 -273.0440 -116.0047 -76.1037 -75.5182 -74.6862 -33.6181 -33.6173 -31.4079 -31.4065 -31.3606 -31.3598 -27.7808 -27.7469 -25.7994 -25.6229 -25.5390 -24.1492 -24.1231 -19.8512 -19.8398 -18.5503 -18.5408 -15.8283 -15.7933 -14.7809 -14.7799 -14.7577 -14.7527 -13.6987 -13.4182 -13.3137 -13.0916 -13.0307 -12.1631 -11.9377 -11.6925 -11.6729 -11.6465 -11.6077 -11.5969 -11.5260 -11.4766 -11.3931 -11.3801 -11.3578 -11.1074 -10.9556 -10.6697 -10.5714 -10.4054 -10.4011 -10.2368 -10.1615 -9.8554 -9.8542 -9.8150 -9.3262 -9.2556 -9.2035 -9.0742 -8.9786 -8.6927 -8.3021 -8.1262 -7.6407 -7.6085 -7.5247 -7.2246 -6.9640 -6.8523 -6.6749 -6.2942 -1.4329 -1.3571 -1.0371 -0.9092 -0.7979 -0.6806 0.0580 0.7072 1.4508 1.7300 2.1569 electronvolt
energy: -8767.1492 -1047.1440 -917.0928 -917.0707 -917.0611 -665.2644 -665.2637 -665.2470 -665.2457 -665.2453 -665.2445 -514.3831 -514.3816 -513.9984 -513.8873 -513.8860 -384.8255 -384.8080 -278.5232 -278.5227 -275.4833 -275.4830 -273.9880 -273.9715 -273.0458 -273.0428 -115.0997 -74.6951 -74.6022 -74.3504 -33.6139 -33.6131 -31.4029 -31.4015 -31.3594 -31.3587 -27.7059 -27.6727 -25.7476 -25.5324 -25.4792 -24.1115 -24.0877 -19.8452 -19.8344 -18.5140 -18.5067 -15.7873 -15.7622 -14.7762 -14.7752 -14.7471 -14.7436 -13.6193 -13.4099 -13.2670 -12.9779 -12.9669 -12.0813 -11.7301 -11.6832 -11.6260 -11.6066 -11.6005 -11.5423 -11.4889 -11.4713 -11.3654 -11.3397 -11.3373 -11.0930 -10.9233 -10.6029 -10.5329 -10.3990 -10.3935 -10.2263 -10.1474 -9.8532 -9.8519 -9.7484 -9.2821 -9.1859 -9.1341 -9.0419 -8.5836 -8.2977 -8.1637 -7.8937 -7.5731 -7.3612 -7.0916 -7.0877 -6.9101 -6.8201 -6.2345 -4.8599 -1.4156 -1.3410 -1.0082 -0.8768 -0.7622 -0.6501 0.0694 0.7076 1.4627 1.7444 electronvolt
chargesum: -0.0000000
charge: -0.427895 -0.427597 0.331253 -0.380958 -0.381061 0.331566 0.412327 0.412488 -0.156834 -0.149889 -0.155643 -0.157195 -0.149845 -0.155338 -0.459198 0.254841 0.255132 0.302305 -0.090898 0.114541 -0.021869 0.117797 0.117960 0.118734 -0.066559 0.077804 -0.019122 0.117910 0.117532 0.117709
charge: 0.086767 0.087112 -0.539285 0.153553 0.153758 -0.539273 -0.624796 -0.624841 0.180826 0.196512 0.182765 0.180329 0.196584 0.183285 0.350770 -0.143529 -0.142918 -0.165021 -0.021985 0.210606 0.057434 0.056984 0.056980 0.057211 -0.022952 0.206152 0.056742 0.056712 0.056606 0.056912
qa: -0.4279 -0.4276 0.3313 -0.3810 -0.3811 0.3316 0.4123 0.4125 -0.1568 -0.1499 -0.1556 -0.1572 -0.1498 -0.1553 -0.4592 0.2548 0.2551 0.3023 -0.0909 0.1145 -0.0219 0.1178 0.1180 0.1187 -0.0666 0.0778 -0.0191 0.1179 0.1175 0.1177
va: 2.0713 2.0719 4.1465 2.0950 2.0948 4.1461 4.5350 4.5346 1.1458 1.1682 1.1480 1.1453 1.1682 1.1487 2.0050 1.0386 1.0375 2.8700 3.7703 3.1453 3.9076 1.0038 1.0037 1.0038 3.6833 3.1370 3.9114 1.0037 1.0038 1.0036
dispersion: -0.038430246 hartree
energy: -3035.829044225969 hartree
dipole: -0.037456439 2.190044684 2.152588245 0.708072865 0.221606299 0.929679164 0.974966312 -0.171566453 0.803399859
dipolemethod: SCF
magnitude: 2.478586459 au
magnitude: 6.300066105 debye
temp: 298.15 k
press: 1.00 atm
zeropoint: 0.17009733 hartree
thermalvibcorrection: 0.02526624 hartree
thermalrotcorrection: 0.00141627 hartree
thermaltrasncorrection: 0.00141627 hartree
thermaltotal: -3035.63084811 hartree
thermalcorr: 0.02809878 hartree
nonthermalcorr: 0.17009733 hartree
totalcorr: 0.19819611 hartree
thermalcorrenthalpy: 0.00094421 hartree
totalenthalpy: -3035.62990390 hartree
vibrat: 0.04902249 hartree
rotat: 0.01679618 hartree
transl: 0.02079766 hartree
total: 0.08727078 hartree
totalentropycorr: -0.08727078 hartree
gibbsenthalpy: -3035.71717469 hartree
gibbsminuselec: 0.11186954 hartree
