program: Orca
programVersion: 6.0.0
elementType: O O C O O C C C F F F F F F O H H Cu C N C H H H C N C H H H
charge: 0
multiplicity: 2
keywords: TPSS D3BJ TightOpt Freq def2-TZVPP def2/J RIJCOSX TightSCF defgrid3 CPCM(Acetonitrile)
frequency: 0.00 0.00 0.00 0.00 0.00 0.00 8.81 11.61 14.32 16.70 19.91 20.77 30.15 31.60 34.91 46.44 66.13 72.47 94.72 104.94 107.11 122.32 125.86 179.53 184.24 185.40 189.06 192.87 212.29 222.14 251.41 272.69 272.87 285.71 305.55 312.65 392.62 397.44 402.03 408.57 411.13 413.94 465.21 481.74 494.01 495.24 558.88 582.15 589.24 687.89 688.89 756.89 762.98 764.42 775.02 836.64 848.36 940.75 946.40 1036.10 1037.47 1038.93 1040.61 1053.51 1054.03 1098.28 1098.96 1141.65 1150.69 1351.77 1355.60 1378.02 1382.39 1432.23 1432.70 1434.43 1434.67 1618.75 1626.78 1654.29 2330.47 2333.21 3019.95 3020.45 3098.48 3098.95 3099.45 3100.00 3336.30 3363.34
frequency: 8.81 11.61 14.32 16.70 19.91 20.77 30.15 31.60 34.91 46.44 66.13 72.47 94.72 104.94 107.11 122.32 125.86 179.53 184.24 185.40 189.06 192.87 212.29 222.14 251.41 272.69 272.87 285.71 305.55 312.65 392.62 397.44 402.03 408.57 411.13 413.94 465.21 481.74 494.01 495.24 558.88 582.15 589.24 687.89 688.89 756.89 762.98 764.42 775.02 836.64 848.36 940.75 946.40 1036.10 1037.47 1038.93 1040.61 1053.51 1054.03 1098.28 1098.96 1141.65 1150.69 1351.77 1355.60 1378.02 1382.39 1432.23 1432.70 1434.43 1434.67 1618.75 1626.78 1654.29 2330.47 2333.21 3019.95 3020.45 3098.48 3098.95 3099.45 3100.00 3336.30 3363.34
formula: C8H8CuF6N2O5
InChI: InChI=1/2C2F3O2.2C2H3N.Cu.H2O/c2*3-2(4,5)1(6)7;2*1-2-3;;/h;;2*1H3;;1H2/q2*-1;;;+2;/rC8H6CuF6N2O4.H2O/c1-3-16-9(17-4-2,20-5(18)7(10,11)12)21-6(19)8(13,14)15;/h1-2H3;1H2
30 atoms
O  0.568525 1.28038 8.326086
O  1.690341 2.662997 4.401466
C  2.882425 2.567115 4.716068
O  2.767574 1.884574 8.253083
O  3.478345 2.850039 5.807413
C  1.776352 1.139207 8.550523
C  2.239971 -0.139124 9.323124
C  3.885517 2.020301 3.648065
F  3.119392 -0.865213 8.585718
F  1.208545 -0.949881 9.63693
F  2.863485 0.193939 10.483643
F  4.527198 0.911663 4.098818
F  3.273148 1.691666 2.491982
F  4.835625 2.947105 3.356278
O  0.424606 3.466625 6.685949
H  0.681762 3.144032 5.787175
H  0.268523 2.648253 7.218164
Cu 2.568296 3.651821 7.374995
C  2.977258 6.46421 6.052156
N  2.856734 5.442037 6.573891
C  3.130184 7.74628 5.396856
H  3.631447 8.442337 6.074757
H  3.72857 7.619747 4.490593
H  2.143456 8.137116 5.133787
C  1.748665 4.815332 10.165637
N  2.09009 4.421819 9.136022
C  1.321704 5.305314 11.459406
H  1.457536 4.518258 12.206062
H  1.920474 6.17839 11.732308
H  0.26602 5.585558 11.409132
totalener: -3035.79133177726544 hartree
nucrepener: 2529.01939972941273 hartree
electener: -5564.76376008085663 hartree
oneelecener: -9251.23727576560123 hartree
twoeener: 3686.47351568474460 hartree
cpcmener: -0.04697142582179 hartree
kineticenergy: 3027.92007352022392 hartree
exchangeener: -226.319095627133 hartree
correlationener: -6.995245628541 hartree
xcener: -233.314341255674 hartree
s2: 0.751624
dispersion: -0.038245734 hartree
elementType: O C F H Cu N
energy: -8767.1932 -1047.5836 -917.5346 -917.5315 -917.2511 -665.2572 -665.2564 -665.2361 -665.2352 -665.2350 -665.2345 -514.4767 -514.4766 -513.8769 -513.8753 -513.7433 -384.9081 -384.9069 -278.5239 -278.5226 -275.4768 -275.4746 -274.0343 -274.0328 -273.0677 -273.0665 -116.0352 -75.8882 -75.8721 -74.6378 -33.6070 -33.6064 -31.3960 -31.3955 -31.3498 -31.3491 -27.7909 -27.7209 -25.7367 -25.6012 -25.3822 -24.2221 -24.1583 -19.8796 -19.8664 -18.5456 -18.5219 -15.8301 -15.7714 -14.7699 -14.7680 -14.7486 -14.7417 -13.7419 -13.3624 -13.1884 -13.1470 -12.9388 -12.1960 -11.8847 -11.7779 -11.7054 -11.6499 -11.6396 -11.6197 -11.5206 -11.4900 -11.4244 -11.3550 -11.3514 -11.1384 -10.9582 -10.7006 -10.5440 -10.3978 -10.3860 -10.2487 -10.1373 -9.8443 -9.8425 -9.7139 -9.5268 -9.2188 -9.2008 -8.9995 -8.5891 -8.5635 -8.3825 -8.0972 -7.8433 -7.8000 -7.3925 -7.3782 -6.8726 -6.8699 -6.5037 -6.3044 -1.4233 -1.2758 -1.1733 -1.0259 -0.7495 -0.6115 0.0295 0.8096 1.2623 1.6300 2.2947 electronvolt
energy: -8767.1877 -1047.1778 -917.1292 -917.1000 -917.0985 -665.2533 -665.2525 -665.2356 -665.2350 -665.2347 -665.2340 -514.3803 -514.3799 -513.8751 -513.8734 -513.7440 -384.8608 -384.8602 -278.5130 -278.5117 -275.4802 -275.4781 -274.0315 -274.0300 -273.0663 -273.0649 -115.1250 -74.6926 -74.6818 -74.3482 -33.6028 -33.6022 -31.3911 -31.3905 -31.3488 -31.3481 -27.7151 -27.6474 -25.6661 -25.5098 -25.3661 -24.1786 -24.1146 -19.8729 -19.8592 -18.5107 -18.4867 -15.7945 -15.7354 -14.7652 -14.7634 -14.7384 -14.7317 -13.6668 -13.2694 -13.1354 -13.1344 -12.8208 -12.1407 -11.7206 -11.6978 -11.6774 -11.6370 -11.6182 -11.5019 -11.4785 -11.4307 -11.3902 -11.3424 -11.3268 -11.1233 -10.9329 -10.6462 -10.5085 -10.3924 -10.3769 -10.2390 -10.1265 -9.8424 -9.8407 -9.6741 -9.4832 -9.1528 -9.1467 -8.9281 -8.4225 -8.2870 -7.9488 -7.8853 -7.5067 -7.4249 -7.3151 -7.2441 -6.8260 -6.8163 -6.1377 -4.8281 -1.4095 -1.2586 -1.1437 -0.9916 -0.7090 -0.5737 0.0404 0.8103 1.2779 1.6355 electronvolt
chargesum: -0.0000000
charge: -0.425012 -0.423961 0.330116 -0.376908 -0.377629 0.332841 0.409359 0.409104 -0.155721 -0.149940 -0.157164 -0.155708 -0.150029 -0.157329 -0.488203 0.253451 0.254597 0.279115 -0.071409 0.116587 -0.023536 0.118275 0.118477 0.118494 -0.073763 0.114627 -0.024569 0.118612 0.118310 0.118915
charge: 0.090263 0.091268 -0.538382 0.155251 0.155437 -0.539120 -0.624560 -0.624516 0.182383 0.196313 0.180965 0.182449 0.196346 0.180838 0.322001 -0.155268 -0.154156 -0.145293 -0.019204 0.212907 0.058000 0.057124 0.057132 0.057301 -0.018847 0.213571 0.058097 0.057212 0.057139 0.057351
qa: -0.4250 -0.4240 0.3301 -0.3769 -0.3776 0.3328 0.4094 0.4091 -0.1557 -0.1499 -0.1572 -0.1557 -0.1500 -0.1573 -0.4882 0.2535 0.2546 0.2791 -0.0714 0.1166 -0.0235 0.1183 0.1185 0.1185 -0.0738 0.1146 -0.0246 0.1186 0.1183 0.1189
va: 2.0760 2.0796 4.1513 2.0973 2.0977 4.1465 4.5456 4.5452 1.1473 1.1685 1.1456 1.1474 1.1684 1.1454 1.9797 1.0498 1.0479 2.8132 3.7095 3.1677 3.9084 1.0034 1.0034 1.0037 3.7173 3.1699 3.9077 1.0033 1.0034 1.0036
dispersion: -0.038245506 hartree
energy: -3035.829577536737 hartree
dipole: -10.160063045 10.464723882 0.304660836 29.526293619 -22.652707628 6.873585991 8.758198638 -5.972036503 2.786162136
dipolemethod: SCF
magnitude: 7.423052071 au
magnitude: 18.867898907 debye
temp: 298.15 k
press: 1.00 atm
zeropoint: 0.17028866 hartree
thermalvibcorrection: 0.02517459 hartree
thermalrotcorrection: 0.00141627 hartree
thermaltrasncorrection: 0.00141627 hartree
thermaltotal: -3035.63128174 hartree
thermalcorr: 0.02800713 hartree
nonthermalcorr: 0.17028866 hartree
totalcorr: 0.19829580 hartree
thermalcorrenthalpy: 0.00094421 hartree
totalenthalpy: -3035.63033753 hartree
vibrat: 0.04928870 hartree
rotat: 0.01678974 hartree
transl: 0.02079766 hartree
total: 0.08753056 hartree
totalentropycorr: -0.08753056 hartree
gibbsenthalpy: -3035.71786809 hartree
gibbsminuselec: 0.11170945 hartree
