program: Orca
programVersion: 6.0.0
elementType: O O C O O C C C F F F F F F O H H Cu
charge: 0
multiplicity: 2
keywords: b3lyp d3bj def2-TZVPP def2/J RIJCOSX TightSCF defgrid3 CPCM(Acetonitrile)
formula: C4H2CuF6O5
InChI: InChI=1/2C2F3O2.Cu.H2O/c2*3-2(4,5)1(6)7;;/h;;;1H2/q-2;-1;+3;/rC4H2CuF6O5/c6-3(7,8)1(12)14-5(13)15-2(16-5)4(9,10)11/h13H2
18 atoms
O  2.055011 2.657169 8.107154
O  1.692285 6.421366 7.090072
C  1.8683 5.874002 5.962637
O  1.980555 2.505298 10.378863
O  2.026481 4.622658 5.863796
C  2.101733 2.052254 9.231975
C  2.350725 0.52164 9.061947
C  1.861206 6.72983 4.678105
F  3.526596 0.293026 8.425922
F  1.367776 -0.047427 8.321021
F  2.394141 -0.117645 10.246645
F  1.989835 8.040417 4.952847
F  2.866371 6.367171 3.853942
F  0.692816 6.550357 4.016029
O  1.514052 4.988778 9.783245
H  2.16148 5.636146 10.113505
H  1.713167 4.106132 10.235852
Cu 1.826245 4.5590 7.895112
elementType: O C F H Cu
totalener: -2769.42990769235985 hartree
nucrepener: 1629.15485343758883 hartree
electener: -4398.55101025783551 hartree
oneelecener: -7091.37481765834491 hartree
twoeener: 2692.82380740050939 hartree
cpcmener: -0.03375591253638 hartree
kineticenergy: 2762.75863974111780 hartree
exchangeener: -150.382828430252 hartree
correlationener: -6.838997242380 hartree
xcener: -157.221825672633 hartree
s2: 0.752110
energy: -8792.9334 -1059.8140 -929.3705 -929.3552 -929.0352 -673.1000 -673.0911 -673.0865 -672.8726 -672.8611 -672.8610 -521.8762 -521.6157 -521.5681 -521.3860 -520.9207 -284.4236 -284.0678 -281.5001 -281.1803 -120.9462 -80.4193 -80.3471 -78.9993 -36.2797 -36.0215 -33.9758 -33.9270 -33.7221 -33.6777 -30.7643 -30.1276 -28.6778 -27.9785 -27.8480 -20.8561 -20.4405 -17.9205 -17.6661 -16.7825 -16.7672 -16.5308 -16.5246 -15.7065 -15.1553 -14.8265 -14.1809 -13.8293 -13.5358 -13.4065 -13.2923 -13.1874 -13.1789 -13.0980 -12.9792 -12.7549 -12.3972 -12.3256 -12.2520 -12.1961 -11.9610 -11.8509 -11.6659 -11.6418 -11.2106 -11.0270 -10.8824 -10.5931 -10.0866 -9.7611 -9.3309 -9.1888 -8.9580 -8.5684 -8.2062 -1.4245 -0.9085 -0.2573 1.5683 1.9682 2.3839 2.4499 2.7956 3.0726 3.4216 3.6463 electronvolt
energy: -8792.9231 -1059.2241 -928.8754 -928.7201 -928.7117 -673.0981 -673.0901 -673.0863 -672.8707 -672.8611 -672.8609 -521.8153 -521.5420 -521.4937 -521.3167 -520.9215 -284.4246 -284.0625 -281.5057 -281.1830 -119.7461 -78.7060 -78.6525 -78.6168 -36.2779 -36.0192 -33.9726 -33.9260 -33.7192 -33.6774 -30.6341 -30.0684 -28.5482 -27.8117 -27.7713 -20.8349 -20.4137 -17.8955 -17.6295 -16.7824 -16.7579 -16.5287 -16.5140 -15.6438 -15.0506 -14.7056 -13.7372 -13.7191 -13.5180 -13.3118 -13.2850 -13.1703 -13.0684 -12.8745 -12.7507 -12.5969 -12.3864 -12.2609 -12.2255 -12.1755 -11.9388 -11.8486 -11.6406 -11.0498 -10.7624 -10.4422 -10.1656 -9.9230 -9.5709 -9.4016 -9.0831 -8.9767 -8.8401 -8.5304 -3.9999 -1.4100 -0.8980 -0.1989 1.5872 1.9584 2.4012 2.4975 2.8359 3.0979 3.4361 electronvolt
chargesum: -0.0000000
charge: -0.424378 -0.392460 0.446711 -0.417076 -0.399162 0.336948 0.520723 0.512071 -0.180008 -0.179855 -0.174045 -0.164831 -0.166971 -0.170859 -0.365555 0.273300 0.267930 0.677516
charge: 0.127792 0.138346 -0.477410 0.113630 0.138052 -0.489178 -0.599124 -0.602222 0.178664 0.178921 0.192615 0.203030 0.196920 0.190095 0.415811 -0.047366 -0.133161 0.274587
qa: -0.4244 -0.3925 0.4467 -0.4171 -0.3992 0.3369 0.5207 0.5121 -0.1800 -0.1799 -0.1740 -0.1648 -0.1670 -0.1709 -0.3656 0.2733 0.2679 0.6775
va: 2.0784 2.1065 3.8375 2.0864 2.1032 4.1513 4.4531 4.4896 1.1166 1.1168 1.1348 1.1469 1.1406 1.1319 2.2199 0.9851 1.0502 2.4419
dispersion: -0.027358672 hartree
energy: -2769.457266364219 hartree
dipole: -0.139434272 0.440858866 0.301424594 1.198912060 0.443549553 1.642461613 7.219705701 -6.106558711 1.113146990
dipolemethod: SCF
magnitude: 2.006896399 au
magnitude: 5.101125254 debye
