program: Orca
programVersion: 6.0.0
elementType: O O C O O C C C F F F F F F O H H Cu
charge: 0
multiplicity: 2
keywords: TPSS D3BJ TightOpt Freq def2-TZVPP def2/J RIJCOSX TightSCF defgrid3 CPCM(Acetonitrile)
frequency: 0.00 0.00 0.00 0.00 0.00 0.00 11.35 18.25 37.35 43.16 60.61 88.29 104.40 117.67 143.86 164.42 178.34 231.17 250.46 259.90 275.19 286.65 330.54 399.82 421.35 429.74 449.32 461.69 494.63 495.36 497.90 571.76 598.12 691.08 697.22 706.16 764.48 766.07 808.94 837.49 995.62 1062.49 1074.61 1107.25 1117.40 1146.53 1157.09 1372.07 1460.48 1532.45 1568.89 1639.41 2938.76 3698.67
frequency: 11.35 18.25 37.35 43.16 60.61 88.29 104.40 117.67 143.86 164.42 178.34 231.17 250.46 259.90 275.19 286.65 330.54 399.82 421.35 429.74 449.32 461.69 494.63 495.36 497.90 571.76 598.12 691.08 697.22 706.16 764.48 766.07 808.94 837.49 995.62 1062.49 1074.61 1107.25 1117.40 1146.53 1157.09 1372.07 1460.48 1532.45 1568.89 1639.41 2938.76 3698.67
formula: C4H2CuF6O5
InChI: InChI=1/2C2F3O2.Cu.H2O/c2*3-2(4,5)1(6)7;;/h;;;1H2/q-2;-1;+3;/rC4H2CuF6O5/c6-3(7,8)1(12)14-5(13)15-2(16-5)4(9,10)11/h13H2
18 atoms
O  2.055011 2.657169 8.107154
O  1.692285 6.421366 7.090072
C  1.8683 5.874002 5.962637
O  1.980555 2.505298 10.378863
O  2.026481 4.622658 5.863796
C  2.101733 2.052254 9.231975
C  2.350725 0.52164 9.061947
C  1.861206 6.72983 4.678105
F  3.526596 0.293026 8.425922
F  1.367776 -0.047427 8.321021
F  2.394141 -0.117645 10.246645
F  1.989835 8.040417 4.952847
F  2.866371 6.367171 3.853942
F  0.692816 6.550357 4.016029
O  1.514052 4.988778 9.783245
H  2.16148 5.636146 10.113505
H  1.713167 4.106132 10.235852
Cu 1.826245 4.5590 7.895112
totalener: -2770.09212097395539 hartree
nucrepener: 1628.88248396243011 hartree
electener: -4398.94558102060637 hartree
oneelecener: -7091.33270802040533 hartree
twoeener: 2692.38712699979897 hartree
cpcmener: -0.02902391577949 hartree
kineticenergy: 2763.40797323321249 hartree
exchangeener: -189.994664677786 hartree
correlationener: -5.563993475168 hartree
xcener: -195.558658152953 hartree
s2: 0.751452
dispersion: -0.019941462 hartree
dispersion: -0.019941866 hartree
dispersion: -0.019941716 hartree
dispersion: -0.019941491 hartree
dispersion: -0.019941398 hartree
dispersion: -0.019941187 hartree
s2: 0.751451
dispersion: -0.019940886 hartree
dispersion: -0.019940824 hartree
dispersion: -0.019940840 hartree
dispersion: -0.019940910 hartree
dispersion: -0.019941031 hartree
dispersion: -0.019941164 hartree
dispersion: -0.019941306 hartree
dispersion: -0.019941294 hartree
dispersion: -0.019941191 hartree
dispersion: -0.019938403 hartree
dispersion: -0.019940725 hartree
dispersion: -0.019941001 hartree
dispersion: -0.019941216 hartree
dispersion: -0.019941573 hartree
dispersion: -0.019942661 hartree
s2: 0.751450
dispersion: -0.019943102 hartree
dispersion: -0.019943597 hartree
dispersion: -0.019943260 hartree
dispersion: -0.019943359 hartree
dispersion: -0.019943429 hartree
dispersion: -0.019943427 hartree
dispersion: -0.019942232 hartree
dispersion: -0.019941995 hartree
dispersion: -0.019941665 hartree
dispersion: -0.019941086 hartree
dispersion: -0.019940545 hartree
dispersion: -0.019940324 hartree
dispersion: -0.019940310 hartree
dispersion: -0.019940450 hartree
dispersion: -0.019941129 hartree
dispersion: -0.019941257 hartree
dispersion: -0.019941423 hartree
dispersion: -0.019941490 hartree
elementType: O C F H Cu
energy: -8767.3622 -1047.6988 -917.6527 -917.6382 -917.3838 -665.6100 -665.5973 -665.5888 -665.3847 -665.3631 -665.3609 -515.3170 -515.1040 -515.0604 -514.8619 -514.2955 -279.0652 -278.7143 -276.1837 -275.8313 -116.1745 -76.0227 -75.9523 -74.8762 -34.0162 -33.7573 -31.7941 -31.7421 -31.5405 -31.4915 -28.8385 -28.1735 -26.8884 -26.1666 -25.9769 -19.1890 -18.7660 -16.2948 -16.0434 -15.1660 -15.1460 -14.9138 -14.9086 -14.3219 -13.6106 -13.3390 -12.5138 -12.3774 -12.0161 -11.6977 -11.6826 -11.6047 -11.5603 -11.4906 -11.3619 -11.2886 -10.7874 -10.7281 -10.6155 -10.5262 -10.3511 -10.1699 -9.9604 -9.7985 -9.3558 -8.7782 -8.6744 -8.3307 -8.2569 -8.1255 -7.8306 -7.6978 -7.5082 -7.2466 -6.5127 -2.1898 -1.6657 -0.5956 1.2037 1.5930 1.8864 1.9809 2.2527 2.4379 2.8947 3.1120 electronvolt
energy: -8767.3570 -1047.3078 -917.2658 -917.2340 -917.2211 -665.6075 -665.5958 -665.5885 -665.3816 -665.3630 -665.3606 -515.2524 -515.0191 -514.9740 -514.7841 -514.2951 -279.0662 -278.7071 -276.1892 -275.8342 -115.2966 -74.8653 -74.8078 -74.5953 -34.0140 -33.7542 -31.7902 -31.7408 -31.5366 -31.4908 -28.7091 -28.1140 -26.7730 -26.0048 -25.9038 -19.1691 -18.7386 -16.2737 -16.0166 -15.1656 -15.1387 -14.9105 -14.8990 -14.2814 -13.5488 -13.2596 -12.3365 -12.2997 -11.9902 -11.6746 -11.6612 -11.5806 -11.4801 -11.3571 -11.2962 -11.1929 -10.7459 -10.7136 -10.6068 -10.5200 -10.3441 -10.1676 -9.9588 -9.4613 -8.8875 -8.5218 -8.4493 -8.1862 -8.1175 -7.8603 -7.5019 -7.2682 -7.2242 -7.1439 -5.0798 -2.1722 -1.6538 -0.5395 1.2278 1.5668 1.9148 2.0116 2.2737 2.4691 2.9087 electronvolt
chargesum: -0.0000000
charge: -0.385503 -0.342682 0.443926 -0.387071 -0.349445 0.320334 0.425774 0.410910 -0.150887 -0.150701 -0.144835 -0.135706 -0.137612 -0.141047 -0.363343 0.284759 0.263685 0.539443
charge: 0.149787 0.164560 -0.495373 0.129420 0.164886 -0.507679 -0.627645 -0.631204 0.189099 0.189359 0.203304 0.213663 0.207664 0.200998 0.425782 -0.046898 -0.136554 0.206831
qa: -0.3855 -0.3427 0.4439 -0.3871 -0.3494 0.3203 0.4258 0.4109 -0.1509 -0.1507 -0.1448 -0.1357 -0.1376 -0.1410 -0.3633 0.2848 0.2637 0.5394
va: 2.1418 2.1695 3.8134 2.1310 2.1663 4.1586 4.5406 4.5794 1.1563 1.1566 1.1763 1.1880 1.1812 1.1725 2.2284 0.9742 1.0553 2.4237
dispersion: -0.019941545 hartree
energy: -2770.112164689886 hartree
dipole: -0.139434012 0.430886168 0.291452156 1.198912232 0.432732796 1.631645028 7.219705861 -6.178437600 1.041268261
dipolemethod: SCF
magnitude: 1.957408861 au
magnitude: 4.975337927 debye
temp: 298.15 k
press: 1.00 atm
zeropoint: 0.07874360 hartree
thermalvibcorrection: 0.01443033 hartree
thermalrotcorrection: 0.00141627 hartree
thermaltrasncorrection: 0.00141627 hartree
thermaltotal: -2770.01615821 hartree
thermalcorr: 0.01726288 hartree
nonthermalcorr: 0.07874360 hartree
totalcorr: 0.09600648 hartree
thermalcorrenthalpy: 0.00094421 hartree
totalenthalpy: -2770.01521400 hartree
vibrat: 0.02692256 hartree
rotat: 0.01602179 hartree
transl: 0.02046258 hartree
total: 0.06406138 hartree
totalentropycorr: -0.06406138 hartree
gibbsenthalpy: -2770.07927538 hartree
gibbsminuselec: 0.03288931 hartree
