program: Orca
programVersion: 6.0.0
elementType: O O C O O C C C F F F F F F O H H Cu O H H C N C H H H
charge: 0
multiplicity: 2
keywords: TPSS D3BJ TightOpt Freq def2-TZVPP def2/J RIJCOSX TightSCF defgrid3 CPCM(Acetonitrile)
frequency: 0.00 0.00 0.00 0.00 0.00 0.00 10.34 11.09 15.12 16.25 26.18 35.27 39.46 47.70 53.08 62.29 93.36 98.41 106.81 128.91 144.35 150.24 156.78 161.36 220.98 233.21 246.26 259.07 265.56 284.84 321.17 330.99 385.37 393.92 395.36 425.76 428.96 440.06 452.62 469.11 483.89 494.99 495.42 586.10 591.65 651.72 666.61 694.74 696.77 764.38 765.44 804.76 808.81 926.79 969.37 991.91 1040.72 1042.47 1056.14 1056.75 1102.04 1102.45 1146.95 1152.32 1375.45 1377.90 1383.65 1437.92 1438.78 1571.87 1578.82 1635.79 1642.99 2305.66 2981.36 3015.09 3021.26 3098.33 3099.31 3713.22 3715.42
frequency: 10.34 11.09 15.12 16.25 26.18 35.27 39.46 47.70 53.08 62.29 93.36 98.41 106.81 128.91 144.35 150.24 156.78 161.36 220.98 233.21 246.26 259.07 265.56 284.84 321.17 330.99 385.37 393.92 395.36 425.76 428.96 440.06 452.62 469.11 483.89 494.99 495.42 586.10 591.65 651.72 666.61 694.74 696.77 764.38 765.44 804.76 808.81 926.79 969.37 991.91 1040.72 1042.47 1056.14 1056.75 1102.04 1102.45 1146.95 1152.32 1375.45 1377.90 1383.65 1437.92 1438.78 1571.87 1578.82 1635.79 1642.99 2305.66 2981.36 3015.09 3021.26 3098.33 3099.31 3713.22 3715.42
formula: C6H7CuF6NO6
InChI: InChI=1/2C2F3O2.C2H3N.Cu.2H2O/c2*3-2(4,5)1(6)7;1-2-3;;;/h;;1H3;;2*1H2/q2*-1;;+2;;/rC4H4CuF6O6.C2H3N/c6-3(7,8)1(12)16-5(14,15)17-2(13)4(9,10)11;1-2-3/h14-15H2;1H3
27 atoms
O  1.061022 0.937217 7.696814
O  3.77749 6.860276 6.654296
C  2.672928 6.612205 6.143607
O  2.861494 2.253575 8.158633
O  1.988699 5.539852 6.157288
C  2.169461 1.186034 8.197571
C  2.885727 0.052477 8.996034
C  1.959754 7.749861 5.347592
F  4.014847 -0.341183 8.349722
F  2.106317 -1.036897 9.151134
F  3.252477 0.473347 10.231928
F  0.748066 8.034749 5.889518
F  2.676583 8.891723 5.331163
F  1.75018 7.379223 4.058285
O  0.517562 3.364689 6.901015
H  0.208399 3.480232 5.986908
H  0.528552 2.375205 7.087692
Cu 2.47697 3.83279 7.027821
O  4.295226 4.482163 7.582207
H  4.386829 4.416305 8.547704
H  4.261541 5.463854 7.352768
C  3.247284 2.160247 4.207385
N  3.060152 2.815876 5.141938
C  3.483155 1.340802 3.03335
H  3.029728 1.816593 2.159744
H  4.559219 1.233725 2.873028
H  3.037392 0.353833 3.183078
totalener: -2979.42052636764720 hartree
nucrepener: 2241.73201865525016 hartree
electener: -5221.11471112118670 hartree
oneelecener: -8601.62742089588392 hartree
twoeener: 3380.51270977469721 hartree
cpcmener: -0.03783390171076 hartree
kineticenergy: 2971.76645308210664 hartree
exchangeener: -217.158933769037 hartree
correlationener: -6.612682272015 hartree
xcener: -223.771616041052 hartree
s2: 0.751461
dispersion: -0.033096814 hartree
s2: 0.751454
dispersion: -0.032872537 hartree
s2: 0.751430
dispersion: -0.032624703 hartree
s2: 0.751415
dispersion: -0.032527445 hartree
s2: 0.751397
dispersion: -0.032627856 hartree
s2: 0.751398
dispersion: -0.032579868 hartree
s2: 0.751403
dispersion: -0.032596357 hartree
s2: 0.751396
dispersion: -0.032624030 hartree
s2: 0.751392
dispersion: -0.032658315 hartree
s2: 0.751386
dispersion: -0.032722307 hartree
s2: 0.751380
dispersion: -0.032781422 hartree
s2: 0.751376
dispersion: -0.032785647 hartree
s2: 0.751370
dispersion: -0.032770772 hartree
s2: 0.751365
dispersion: -0.032744054 hartree
s2: 0.751362
dispersion: -0.032723316 hartree
s2: 0.751361
dispersion: -0.032715954 hartree
s2: 0.751360
dispersion: -0.032715936 hartree
dispersion: -0.032721005 hartree
dispersion: -0.032727681 hartree
s2: 0.751363
dispersion: -0.032732121 hartree
dispersion: -0.032734215 hartree
dispersion: -0.032734833 hartree
dispersion: -0.032735104 hartree
dispersion: -0.032735702 hartree
dispersion: -0.032737238 hartree
dispersion: -0.032742023 hartree
dispersion: -0.032746752 hartree
dispersion: -0.032756757 hartree
dispersion: -0.032762372 hartree
dispersion: -0.032769430 hartree
dispersion: -0.032773604 hartree
dispersion: -0.032775155 hartree
dispersion: -0.032774175 hartree
dispersion: -0.032771785 hartree
dispersion: -0.032768904 hartree
dispersion: -0.032767462 hartree
dispersion: -0.032766747 hartree
dispersion: -0.032766451 hartree
dispersion: -0.032765926 hartree
dispersion: -0.032765905 hartree
dispersion: -0.032766612 hartree
dispersion: -0.032768305 hartree
dispersion: -0.032770341 hartree
dispersion: -0.032773628 hartree
s2: 0.751364
dispersion: -0.032783089 hartree
dispersion: -0.032779517 hartree
dispersion: -0.032781313 hartree
dispersion: -0.032776960 hartree
dispersion: -0.032776834 hartree
dispersion: -0.032781078 hartree
dispersion: -0.032782405 hartree
dispersion: -0.032784206 hartree
dispersion: -0.032785350 hartree
dispersion: -0.032787920 hartree
dispersion: -0.032789190 hartree
dispersion: -0.032791966 hartree
dispersion: -0.032794065 hartree
dispersion: -0.032794354 hartree
dispersion: -0.032796374 hartree
dispersion: -0.032805167 hartree
dispersion: -0.032811179 hartree
dispersion: -0.032813569 hartree
dispersion: -0.032810678 hartree
dispersion: -0.032810598 hartree
elementType: O C F H Cu N
energy: -8766.9631 -1047.3221 -917.2883 -917.2551 -916.9902 -665.3086 -665.3077 -665.2886 -665.2857 -665.2850 -665.2842 -514.9379 -514.9344 -514.5420 -514.5377 -514.0738 -514.0686 -384.3380 -278.5952 -278.5936 -275.6174 -275.6123 -273.5718 -272.9283 -115.8207 -75.7502 -75.6031 -74.4170 -33.6663 -33.6648 -31.4541 -31.4524 -31.4056 -31.4043 -27.9501 -27.9138 -26.5634 -26.5520 -25.7597 -25.7035 -23.6696 -19.6580 -18.6355 -18.6274 -15.9135 -15.9015 -14.8293 -14.8253 -14.8216 -14.8008 -14.1456 -13.9749 -13.3602 -13.0752 -12.9710 -12.2444 -11.9262 -11.5870 -11.5690 -11.4471 -11.4386 -11.4204 -11.4145 -11.3983 -11.2037 -11.1698 -10.8217 -10.6675 -10.6519 -10.5678 -10.4436 -10.4381 -10.2577 -10.2235 -9.8923 -9.8901 -9.6022 -8.9012 -8.8925 -8.8150 -8.6590 -8.2710 -8.0431 -7.7870 -7.7758 -7.4705 -7.1357 -7.0842 -7.0772 -6.7373 -6.2852 -1.5077 -1.4517 -0.6030 -0.5503 -0.2423 0.7282 1.0967 2.0290 2.1113 2.2920 2.4372 electronvolt
energy: -8766.9576 -1046.9106 -916.8664 -916.8367 -916.8271 -665.3057 -665.3046 -665.2887 -665.2850 -665.2848 -665.2841 -514.8729 -514.8694 -514.4682 -514.4627 -514.0740 -514.0684 -384.3378 -278.5878 -278.5864 -275.6195 -275.6143 -273.5728 -272.9283 -114.8929 -74.4812 -74.4389 -74.1214 -33.6633 -33.6618 -31.4505 -31.4486 -31.4048 -31.4038 -27.8936 -27.8595 -26.4513 -26.4378 -25.6921 -25.6345 -23.6699 -19.6582 -18.6085 -18.6026 -15.8828 -15.8787 -14.8248 -14.8222 -14.8123 -14.7939 -14.1011 -13.9425 -13.2879 -13.0257 -12.9637 -12.1798 -11.8741 -11.5772 -11.5613 -11.4435 -11.4378 -11.4105 -11.3911 -11.1947 -11.1594 -10.9732 -10.7798 -10.6252 -10.5813 -10.4962 -10.4295 -10.4211 -10.2497 -10.2150 -9.8909 -9.8887 -9.3298 -8.8055 -8.7677 -8.5756 -8.4318 -8.1179 -7.8745 -7.7229 -7.5882 -7.1394 -7.0700 -6.9319 -6.8419 -6.2371 -4.7625 -1.4960 -1.4359 -0.5987 -0.5479 -0.2162 0.7370 1.1155 2.0554 2.1192 2.3098 electronvolt
chargesum: -0.0000000
charge: -0.410056 -0.404673 0.294138 -0.391098 -0.377602 0.313289 0.420826 0.423121 -0.156035 -0.148522 -0.153944 -0.154950 -0.148441 -0.155262 -0.365259 0.270645 0.252530 0.510121 -0.365004 0.272486 0.255222 -0.140925 0.035525 -0.015062 0.113110 0.113048 0.112773
charge: 0.109153 0.111677 -0.523545 0.149959 0.151979 -0.525598 -0.625601 -0.625548 0.182587 0.198231 0.186349 0.184502 0.198463 0.184159 0.419193 -0.059873 -0.141081 -0.097720 0.420444 -0.058660 -0.143725 -0.065821 0.162770 0.047543 0.053417 0.053473 0.053275
qa: -0.4101 -0.4047 0.2941 -0.3911 -0.3776 0.3133 0.4208 0.4231 -0.1560 -0.1485 -0.1539 -0.1549 -0.1484 -0.1553 -0.3653 0.2706 0.2525 0.5101 -0.3650 0.2725 0.2552 -0.1409 0.0355 -0.0151 0.1131 0.1130 0.1128
va: 2.1002 2.1043 4.2148 2.1090 2.1148 4.1832 4.5310 4.5277 1.1475 1.1699 1.1523 1.1501 1.1704 1.1490 2.1776 0.9840 1.0649 2.5934 2.1926 0.9810 1.0650 3.8336 2.9382 3.9090 1.0043 1.0043 1.0050
dispersion: -0.032810071 hartree
energy: -2979.465159080067 hartree
dipole: 2.994676927 -2.613930055 0.380746871 -8.190336009 6.705852752 -1.484483257 -12.950901453 10.625797874 -2.325103579
dipolemethod: SCF
magnitude: 2.784737936 au
magnitude: 7.078241317 debye
temp: 298.15 k
press: 1.00 atm
zeropoint: 0.14898367 hartree
thermalvibcorrection: 0.02240785 hartree
thermalrotcorrection: 0.00141627 hartree
thermaltrasncorrection: 0.00141627 hartree
thermaltotal: -2979.29093502 hartree
thermalcorr: 0.02524039 hartree
nonthermalcorr: 0.14898367 hartree
totalcorr: 0.17422406 hartree
thermalcorrenthalpy: 0.00094421 hartree
totalenthalpy: -2979.28999081 hartree
vibrat: 0.04330181 hartree
rotat: 0.01660598 hartree
transl: 0.02071136 hartree
total: 0.08127360 hartree
totalentropycorr: -0.08127360 hartree
gibbsenthalpy: -2979.37126441 hartree
gibbsminuselec: 0.09389467 hartree
