program: Orca
programVersion: 6.0.0
elementType: O O C O O C C C F F F F F F O H H O H H Cu
charge: 0
multiplicity: 2
keywords: b3lyp d3bj def2-TZVPP def2/J RIJCOSX TightSCF defgrid3 CPCM(Acetonitrile)
formula: C4H4CuF6O6
InChI: InChI=1/2C2F3O2.Cu.2H2O/c2*3-2(4,5)1(6)7;;;/h;;;2*1H2/q2*-1;+2;;/rC4H4CuF6O6/c6-3(7,8)1(12)16-5(14,15)17-2(13)4(9,10)11/h14-15H2
21 atoms
O  2.247099 2.070218 8.250432
O  2.063269 5.575305 6.523292
C  2.048019 5.801677 5.267918
O  2.157002 2.633709 10.456497
O  2.138597 5.010831 4.317028
C  2.258775 1.843931 9.505915
C  2.418516 0.324521 9.823319
C  1.908444 7.322943 4.950068
F  3.539366 -0.178886 9.249535
F  1.362286 -0.377833 9.33939
F  2.494827 0.087146 11.14749
F  0.828343 7.858422 5.569727
F  3.003734 7.999352 5.382962
F  1.780091 7.556358 3.629155
O  2.692833 2.902568 5.721587
H  2.168004 2.095528 5.584273
H  2.446307 3.560299 4.996092
O  1.608549 4.742167 9.050314
H  2.134016 5.548434 9.189589
H  1.851233 4.083747 9.776506
Cu 2.152317 3.822457 7.386495
elementType: O C F H Cu
totalener: -2845.89041298319626 hartree
nucrepener: 1802.96117781948396 hartree
electener: -4648.81534206794277 hartree
oneelecener: -7543.93613270852893 hartree
twoeener: 2895.12079064058571 hartree
cpcmener: -0.03624425882704 hartree
kineticenergy: 2838.91925672959314 hartree
exchangeener: -157.509365924748 hartree
correlationener: -7.252135330716 hartree
xcener: -164.761501255464 hartree
s2: 0.751939
energy: -8792.7925 -1059.7121 -929.2654 -929.2576 -928.9225 -672.8418 -672.8414 -672.8310 -672.8306 -672.8303 -672.8301 -521.6883 -521.6875 -521.2222 -521.2220 -520.8227 -520.8206 -284.0153 -284.0150 -281.0872 -281.0866 -120.8397 -80.2937 -80.2662 -78.8762 -35.9844 -35.9841 -33.6874 -33.6871 -33.6429 -33.6423 -30.0418 -29.9999 -28.5242 -28.5212 -27.7714 -27.7010 -20.3902 -20.3777 -17.6289 -17.6000 -16.5034 -16.4953 -16.4948 -16.4732 -15.7987 -15.5245 -15.0463 -14.6738 -13.9778 -13.6432 -13.4971 -13.2549 -13.2449 -13.1557 -13.1229 -12.7168 -12.6834 -12.2944 -12.2652 -12.2504 -12.1668 -12.1527 -11.9387 -11.8478 -11.6197 -11.6155 -11.6141 -11.2276 -10.8579 -10.6460 -10.3364 -10.2023 -9.7249 -9.1601 -9.0159 -8.7482 -8.5508 -8.4416 -8.0504 -0.9088 -0.7833 -0.1817 1.2240 2.0437 2.4295 2.4810 2.5382 3.0435 3.1571 3.5961 electronvolt
energy: -8792.7818 -1059.1020 -928.7571 -928.5954 -928.5898 -672.8399 -672.8394 -672.8311 -672.8306 -672.8303 -672.8301 -521.6237 -521.6229 -521.1552 -521.1550 -520.8239 -520.8219 -284.0101 -284.0098 -281.0888 -281.0882 -119.6009 -78.5264 -78.5195 -78.4794 -35.9822 -35.9819 -33.6845 -33.6843 -33.6428 -33.6421 -29.9857 -29.9466 -28.3938 -28.3861 -27.6998 -27.6276 -20.3619 -20.3540 -17.5809 -17.5729 -16.4940 -16.4932 -16.4875 -16.4663 -15.7099 -15.4862 -14.8954 -14.6050 -13.7859 -13.4348 -13.2505 -13.2421 -13.1496 -13.1074 -12.6907 -12.6692 -12.5612 -12.2477 -12.2059 -12.1643 -12.1059 -12.0966 -11.9029 -11.8246 -11.6139 -11.6129 -11.1463 -10.7608 -10.3735 -10.1085 -9.8922 -9.5401 -9.1443 -8.9849 -8.9032 -8.6239 -8.5004 -8.4273 -3.6347 -0.9047 -0.7689 -0.1320 1.2415 2.0283 2.4365 2.5017 2.5982 3.0669 3.1690 electronvolt
chargesum: -0.0000000
charge: -0.410620 -0.410493 0.334334 -0.423975 -0.424431 0.333966 0.523277 0.523177 -0.181461 -0.182707 -0.175753 -0.181026 -0.183105 -0.175801 -0.343974 0.267031 0.261348 -0.344032 0.267057 0.261365 0.665826
charge: 0.122796 0.122908 -0.497132 0.104949 0.104666 -0.497089 -0.598403 -0.598362 0.177530 0.175641 0.190588 0.178278 0.174991 0.190484 0.414787 -0.053888 -0.137583 0.414818 -0.053919 -0.137739 0.201679
qa: -0.4106 -0.4105 0.3343 -0.4240 -0.4244 0.3340 0.5233 0.5232 -0.1815 -0.1827 -0.1758 -0.1810 -0.1831 -0.1758 -0.3440 0.2670 0.2613 -0.3440 0.2671 0.2614 0.6658
va: 2.0725 2.0727 4.1504 2.0767 2.0762 4.1509 4.4495 4.4494 1.1145 1.1120 1.1323 1.1153 1.1112 1.1322 2.2187 0.9880 1.0564 2.2187 0.9880 1.0565 2.5178
dispersion: -0.032906808 hartree
energy: -2845.923319791062 hartree
dipole: -0.055001526 0.041031782 -0.013969743 -0.006039764 0.004177016 -0.001862748 0.001212503 0.002164178 0.003376681
dipolemethod: SCF
magnitude: 0.014492257 au
magnitude: 0.036836391 debye
