program: Orca
programVersion: 6.0.0
elementType: O O C O O C C C F F F F F F Cu C N C N C N C H H H C H H H C H H H
charge: 0
multiplicity: 2
keywords: b3lyp d3bj def2-TZVPP def2/J RIJCOSX TightSCF defgrid3 CPCM(Acetonitrile)
formula: C10H9CuF6N3O4
InChI: InChI=1/2C2F3O2.3C2H3N.Cu/c2*3-2(4,5)1(6)7;3*1-2-3;/h;;3*1H3;/q2*-1;;;;+2/rC10H9CuF6N3O4/c1-4-18-11(19-5-2,20-6-3,23-7(21)9(12,13)14)24-8(22)10(15,16)17/h1-3H3
33 atoms
O  0.129719 2.010676 9.508221
O  3.000739 7.048984 7.77068
C  2.231607 6.705714 6.877011
O  2.316894 2.502783 9.080835
O  1.657295 5.580633 6.655484
C  1.343449 1.853665 9.606331
C  1.884589 0.687769 10.502419
C  1.825707 7.751914 5.783756
F  2.633187 -0.187501 9.778463
F  0.888148 -0.019315 11.078167
F  2.675362 1.158221 11.504328
F  0.483887 7.977224 5.791577
F  2.432325 8.944688 5.966131
F  2.15235 7.320721 4.535917
Cu 1.965844 4.055585 7.892036
C  0.564545 5.612225 10.235194
N  1.076818 5.040805 9.373219
C  5.049709 3.951721 7.032223
N  3.944063 3.986061 7.363727
C  0.4850 2.152029 5.759389
N  1.001678 2.852886 6.51818
C  -0.166905 1.269318 4.811953
H  -0.899218 1.836048 4.230822
H  0.580964 0.841358 4.139124
H  -0.673111 0.466131 5.354201
C  -0.079779 6.327572 11.317618
H  -0.415791 5.613719 12.074464
H  0.631456 7.027787 11.763959
H  -0.939275 6.878676 10.926519
C  6.438428 3.914008 6.618442
H  6.948316 3.09329 7.129927
H  6.491281 3.759658 5.537367
H  6.919687 4.86131 6.876126
elementType: O C F Cu N H
totalener: -3091.22354687909365 hartree
nucrepener: 2750.26749231562371 hartree
electener: -5841.43720850959016 hartree
oneelecener: -9768.33635757382581 hartree
twoeener: 3926.89914906423564 hartree
cpcmener: -0.05383595540463 hartree
kineticenergy: 3082.95439166579490 hartree
exchangeener: -186.175302400107 hartree
correlationener: -9.018605425976 hartree
xcener: -195.193907826083 hartree
s2: 0.752328
energy: -8792.4026 -1059.3315 -928.9819 -928.7133 -928.6091 -672.6395 -672.6351 -672.6326 -672.6319 -672.6297 -672.6286 -520.6603 -520.6548 -520.0980 -520.0905 -390.6048 -390.4630 -390.4219 -283.7068 -283.7009 -280.4569 -280.4532 -279.1080 -279.0042 -278.9694 -277.9506 -277.9265 -277.9165 -120.4536 -80.3696 -79.1784 -78.7213 -35.7477 -35.7432 -33.4598 -33.4554 -33.4208 -33.4174 -29.3491 -29.3255 -27.1655 -27.1382 -25.8174 -25.6973 -25.6526 -21.2500 -21.2054 -21.1890 -20.0372 -20.0172 -17.2582 -17.1833 -16.2669 -16.2631 -16.2392 -16.2307 -14.7941 -14.5562 -14.3799 -14.2953 -14.1106 -13.3847 -13.0579 -13.0482 -13.0298 -12.9893 -12.9689 -12.8240 -12.7755 -12.7188 -12.6787 -12.6174 -12.6036 -12.5975 -12.5662 -12.5179 -12.3108 -12.2492 -12.0902 -11.9815 -11.9511 -11.9322 -11.6737 -11.5016 -11.4319 -11.4191 -10.9604 -10.8005 -10.4502 -10.3446 -10.2772 -9.9745 -9.7974 -9.6686 -9.6551 -9.2170 -9.0366 -8.6791 -8.3097 -8.2487 -7.8984 -7.7469 -7.6062 -0.3652 -0.3560 -0.1081 -0.0454 -0.0251 0.2053 0.2216 0.2720 0.4094 1.0253 1.0904 electronvolt
energy: -8792.3915 -1058.7298 -928.3520 -928.3010 -928.1695 -672.6370 -672.6326 -672.6325 -672.6318 -672.6297 -672.6285 -520.5683 -520.5638 -520.0985 -520.0910 -390.5645 -390.4382 -390.4014 -283.6986 -283.6926 -280.4604 -280.4565 -279.1077 -279.0041 -278.9696 -277.9497 -277.9260 -277.9161 -119.2267 -78.1626 -78.1423 -78.0952 -35.7446 -35.7401 -33.4561 -33.4516 -33.4205 -33.4171 -29.2705 -29.2494 -27.0659 -27.0381 -25.7776 -25.6729 -25.6326 -21.2452 -21.2026 -21.1867 -20.0035 -19.9869 -17.2022 -17.1445 -16.2639 -16.2600 -16.2291 -16.2225 -14.7172 -14.3605 -14.3249 -14.1127 -14.0505 -13.1038 -13.0453 -13.0390 -12.9854 -12.9823 -12.7536 -12.7009 -12.6884 -12.6403 -12.6270 -12.6043 -12.5957 -12.5609 -12.4714 -12.4383 -12.2794 -12.1961 -11.9578 -11.9536 -11.9340 -11.8900 -11.6176 -11.4675 -11.4286 -11.4028 -10.5622 -10.3449 -10.2463 -10.1767 -9.9409 -9.7767 -9.5625 -9.5485 -9.0937 -8.7695 -8.5774 -8.2961 -8.2221 -8.1603 -7.7464 -7.7285 -3.4763 -0.3490 -0.3407 -0.0830 -0.0164 -0.0030 0.2283 0.2387 0.2851 0.4140 1.0260 electronvolt
chargesum: -0.0000000
charge: -0.443757 -0.443572 0.312900 -0.429971 -0.428437 0.313399 0.509073 0.508702 -0.190433 -0.184202 -0.190211 -0.190412 -0.183990 -0.190084 0.421973 0.019070 -0.070755 0.006144 -0.046317 0.003137 -0.045999 -0.124777 0.146334 0.146126 0.146229 -0.129387 0.147524 0.148409 0.148298 -0.125046 0.146575 0.146784 0.146675
charge: 0.035955 0.036211 -0.545642 0.112840 0.113198 -0.545287 -0.595294 -0.595445 0.164617 0.179242 0.164751 0.164513 0.179563 0.165116 -0.211466 -0.020778 0.210969 -0.032275 0.200244 -0.035862 0.197343 0.044905 0.057156 0.057111 0.057145 0.048195 0.058219 0.058414 0.058441 0.045619 0.057352 0.057432 0.057497
qa: -0.4438 -0.4436 0.3129 -0.4300 -0.4284 0.3134 0.5091 0.5087 -0.1904 -0.1842 -0.1902 -0.1904 -0.1840 -0.1901 0.4220 0.0191 -0.0708 0.0061 -0.0463 0.0031 -0.0460 -0.1248 0.1463 0.1461 0.1462 -0.1294 0.1475 0.1484 0.1483 -0.1250 0.1466 0.1468 0.1467
va: 2.0385 2.0397 4.1879 2.0300 2.0307 4.1879 4.4484 4.4487 1.0983 1.1187 1.0989 1.0985 1.1191 1.0990 2.8508 3.6815 3.1654 3.6835 3.0941 3.6845 3.0767 3.8319 0.9877 0.9880 0.9882 3.8268 0.9880 0.9874 0.9873 3.8312 0.9878 0.9878 0.9880
dispersion: -0.055966713 hartree
energy: -3091.279513592482 hartree
dipole: 1.262627045 -0.657780661 0.604846384 -2.663175170 1.770320600 -0.892854570 -3.812103243 2.456921991 -1.355181252
dipolemethod: SCF
magnitude: 1.731919356 au
magnitude: 4.402189155 debye
