program: Orca
programVersion: 6.0.0
elementType: O O C O O C C C F F F F F F O H H Cu O H H O H H C N C H H H
charge: 0
multiplicity: 2
keywords: b3lyp d3bj def2-TZVPP def2/J RIJCOSX TightSCF defgrid3 CPCM(Acetonitrile)
formula: C6H9CuF6NO7
InChI: InChI=1/2C2F3O2.C2H3N.Cu.3H2O/c2*3-2(4,5)1(6)7;1-2-3;;;;/h;;1H3;;3*1H2/q2*-1;;+2;;;/rC4H4CuF6O6.C2H3N.H2O/c6-3(7,8)1(12)16-5(14,15)17-2(13)4(9,10)11;1-2-3;/h14-15H2;1H3;1H2
30 atoms
O  1.165551 1.020709 7.067014
O  3.929833 6.900015 6.353276
C  2.719943 6.789131 6.095406
O  2.811483 2.319285 7.957773
O  1.921816 5.825207 6.320798
C  2.204491 1.228986 7.717221
C  2.936446 -0.005166 8.329898
C  2.008791 7.985684 5.38922
F  4.106445 -0.229897 7.672477
F  2.2017 -1.133154 8.244297
F  3.23821 0.188775 9.637022
F  0.998639 8.469552 6.157618
F  2.851637 9.007614 5.136195
F  1.467341 7.599478 4.205445
O  0.514595 3.513733 6.657476
H  0.32213 3.769012 5.73967
H  0.58926 2.508946 6.674385
Cu 2.40306 4.069938 7.106625
O  1.887749 4.865449 9.340971
H  1.266613 5.608969 9.284365
H  1.395921 4.170344 9.806289
O  4.273865 4.641334 7.637153
H  4.21848 4.803523 8.595523
H  4.326007 5.552274 7.209812
C  3.293159 2.176218 4.509882
N  3.18113 3.204989 5.033096
C  3.427705 0.877847 3.874768
H  3.73419 1.004296 2.833115
H  4.180281 0.289778 4.406978
H  2.467757 0.355759 3.911274
elementType: O C F H Cu N
totalener: -3055.07526133041301 hartree
nucrepener: 2521.70617768163311 hartree
electener: -5576.74329657804446 hartree
oneelecener: -9266.74227092393085 hartree
twoeener: 3689.99897434588638 hartree
cpcmener: -0.03813525209383 hartree
kineticenergy: 3047.14946667290678 hartree
exchangeener: -178.924033785474 hartree
correlationener: -8.523834969082 hartree
xcener: -187.447868754556 hartree
s2: 0.751707
energy: -8792.3771 -1059.2499 -928.8181 -928.7878 -928.4558 -672.7880 -672.7814 -672.7809 -672.7805 -672.7703 -672.7702 -521.4131 -521.3234 -520.9846 -520.9759 -520.9758 -520.6565 -520.6452 -390.0106 -283.9294 -283.9225 -280.9149 -280.9129 -278.6385 -277.8261 -120.4217 -79.9764 -79.8448 -78.3710 -35.9177 -35.9103 -33.6254 -33.6164 -33.5805 -33.5735 -29.8521 -29.8164 -28.2900 -28.2334 -27.9012 -27.5734 -27.5149 -25.2826 -21.0458 -20.2930 -20.2790 -17.5128 -17.4857 -16.4338 -16.4249 -16.4207 -16.4025 -15.4449 -15.2054 -14.8383 -14.7506 -14.4456 -14.0056 -13.6083 -13.3028 -13.2946 -13.1961 -13.1818 -13.0981 -13.0497 -12.7027 -12.5922 -12.4531 -12.3660 -12.2416 -12.1738 -12.1079 -12.1002 -12.0100 -11.8372 -11.8008 -11.7328 -11.5665 -11.5590 -11.4208 -11.1203 -10.8920 -10.4910 -10.3636 -10.0820 -9.9481 -9.7145 -9.5032 -9.4327 -8.9405 -8.7411 -8.5718 -8.4120 -8.3889 -8.2733 -7.8751 -0.7446 -0.6685 0.0463 0.1964 0.2962 0.9303 1.5632 1.7688 2.3234 2.6648 2.7893 electronvolt
energy: -8792.3661 -1058.6341 -928.2913 -928.1303 -928.1234 -672.7863 -672.7815 -672.7806 -672.7787 -672.7703 -672.7702 -521.3548 -521.2645 -520.9771 -520.9212 -520.9144 -520.6574 -520.6463 -390.0109 -283.9246 -283.9175 -280.9164 -280.9146 -278.6396 -277.8260 -119.1623 -78.1301 -78.1107 -77.9766 -35.9158 -35.9083 -33.6231 -33.6137 -33.5800 -33.5734 -29.8003 -29.7663 -28.1709 -28.1179 -27.8955 -27.5088 -27.4474 -25.2833 -21.0461 -20.2694 -20.2569 -17.4736 -17.4598 -16.4314 -16.4230 -16.4113 -16.3962 -15.3710 -15.1671 -14.7637 -14.6821 -14.3895 -14.0016 -13.5322 -13.2572 -13.1992 -13.1789 -13.0923 -13.0249 -12.6909 -12.5808 -12.4564 -12.3622 -12.3246 -12.1660 -12.1278 -12.0942 -11.9490 -11.8897 -11.8094 -11.7072 -11.6524 -11.5648 -11.5554 -11.2911 -10.8222 -10.3965 -10.0498 -9.8872 -9.7173 -9.5168 -9.4168 -9.3772 -9.2661 -8.7146 -8.6864 -8.4429 -8.3461 -8.2601 -7.9382 -3.4424 -0.7348 -0.6559 0.0679 0.2005 0.2984 0.9331 1.5758 1.7794 2.3292 2.6722 electronvolt
chargesum: 0.0000000
charge: -0.443900 -0.437863 0.287793 -0.419692 -0.428135 0.317977 0.515173 0.514338 -0.186333 -0.178880 -0.182423 -0.185002 -0.177977 -0.184369 -0.365054 0.259896 0.252602 0.716299 -0.421235 0.254081 0.255801 -0.355226 0.247353 0.252841 -0.082464 -0.122145 -0.137651 0.148034 0.142789 0.143371
charge: 0.092824 0.092444 -0.509810 0.131900 0.128745 -0.513257 -0.596424 -0.596471 0.171003 0.186664 0.176833 0.172665 0.187029 0.173365 0.406114 -0.062877 -0.141147 -0.135550 0.358141 -0.078244 -0.078233 0.398338 -0.068037 -0.141733 -0.075981 0.123830 0.035052 0.054554 0.054088 0.054174
qa: -0.4439 -0.4379 0.2878 -0.4197 -0.4281 0.3180 0.5152 0.5143 -0.1863 -0.1789 -0.1824 -0.1850 -0.1780 -0.1844 -0.3651 0.2599 0.2526 0.7163 -0.4212 0.2541 0.2558 -0.3552 0.2474 0.2528 -0.0825 -0.1221 -0.1377 0.1480 0.1428 0.1434
va: 2.0432 2.0510 4.2475 2.0413 2.0298 4.1754 4.4442 4.4458 1.1049 1.1278 1.1156 1.1082 1.1285 1.1099 2.1561 0.9943 1.0652 2.5199 2.0304 0.9935 0.9924 2.1585 1.0080 1.0664 3.8565 3.0028 3.8271 0.9871 0.9924 0.9929
dispersion: -0.051834932 hartree
energy: -3055.127096262730 hartree
dipole: 0.641403433 -1.519679133 -0.878275700 -8.041622980 6.586854923 -1.454768057 -4.361449454 3.982025318 -0.379424136
dipolemethod: SCF
magnitude: 1.741172300 au
magnitude: 4.425708271 debye
