program: Orca
programVersion: 6.0.0
elementType: O O C O O C C C F F F F F F O H H Cu O H H O H H C N C H H H
charge: 0
multiplicity: 2
keywords: b3lyp d3bj def2-TZVPP def2/J RIJCOSX TightSCF defgrid3 CPCM(Acetonitrile)
formula: C6H9CuF6NO7
InChI: InChI=1/2C2F3O2.C2H3N.Cu.3H2O/c2*3-2(4,5)1(6)7;1-2-3;;;;/h;;1H3;;3*1H2/q2*-1;;+2;;;/rC4H4CuF6O6.C2H3N.H2O/c6-3(7,8)1(12)16-5(14,15)17-2(13)4(9,10)11;1-2-3;/h14-15H2;1H3;1H2
30 atoms
O  1.165201 0.881963 7.553101
O  3.999449 6.668125 6.265373
C  2.803908 6.516741 5.965316
O  2.850292 2.246586 8.252883
O  1.998208 5.580344 6.268552
C  2.208005 1.152964 8.173354
C  2.886694 0.013777 8.996071
C  2.126661 7.605337 5.07552
F  4.12625 -0.256565 8.510298
F  2.180335 -1.135678 8.965284
F  3.030748 0.369215 10.298074
F  1.029324 8.122753 5.685319
F  2.956261 8.631325 4.795309
F  1.72042 7.073868 3.893337
O  0.586946 3.306712 6.775062
H  0.423611 3.431101 5.825206
H  0.637804 2.3139 6.936378
Cu 2.470545 3.898108 7.211201
O  1.895083 4.913397 9.420313
H  1.255403 5.63126 9.291175
H  1.419377 4.246643 9.940121
O  4.264413 4.596111 7.864841
H  4.037229 4.890427 8.76641
H  4.34624 5.43903 7.321768
C  3.302426 2.372287 4.292276
N  3.341814 2.972254 5.28221
C  3.254841 1.617066 3.053192
H  2.990006 2.283754 2.228426
H  4.23296 1.168712 2.860078
H  2.503776 0.82711 3.138601
elementType: O C F H Cu N
totalener: -3055.07650456458987 hartree
nucrepener: 2504.02583970451269 hartree
electener: -5559.06107866257389 hartree
oneelecener: -9231.77877552164864 hartree
twoeener: 3672.71769685907475 hartree
cpcmener: -0.04126663002644 hartree
kineticenergy: 3047.14800618856043 hartree
exchangeener: -178.925808753162 hartree
correlationener: -8.523205396500 hartree
xcener: -187.449014149662 hartree
s2: 0.751700
energy: -8792.3413 -1059.2131 -928.7843 -928.7477 -928.4196 -672.7766 -672.7713 -672.7667 -672.7639 -672.7627 -672.7612 -521.3954 -521.2645 -520.9597 -520.9489 -520.9371 -520.6256 -520.6209 -390.0885 -283.9160 -283.9085 -280.8945 -280.8852 -278.7048 -277.8513 -120.3875 -79.9581 -79.7983 -78.3339 -35.9064 -35.8984 -33.6113 -33.6006 -33.5715 -33.5665 -29.8193 -29.7842 -28.2718 -28.1999 -27.8657 -27.5438 -27.4864 -25.3470 -21.0743 -20.2770 -20.2645 -17.4958 -17.4686 -16.4221 -16.4156 -16.4074 -16.3892 -15.4122 -15.1645 -14.8172 -14.7382 -14.4309 -14.0585 -13.5603 -13.2796 -13.2358 -13.1789 -13.1715 -13.0857 -13.0352 -12.5989 -12.5958 -12.4833 -12.4496 -12.2597 -12.1612 -12.0985 -12.0866 -12.0349 -11.8329 -11.8173 -11.7243 -11.5577 -11.5489 -11.4948 -11.0535 -10.8481 -10.4777 -10.3217 -10.0507 -10.0031 -9.6072 -9.5471 -9.4540 -8.9093 -8.7096 -8.5400 -8.4018 -8.3690 -8.2476 -7.8549 -0.6904 -0.6464 0.0575 0.1918 0.2950 0.8556 1.6098 1.9113 2.2400 2.6108 2.8591 electronvolt
energy: -8792.3303 -1058.5977 -928.2550 -928.0955 -928.0854 -672.7748 -672.7711 -672.7650 -672.7640 -672.7628 -672.7611 -521.3378 -521.2057 -520.9501 -520.8963 -520.8758 -520.6266 -520.6219 -390.0888 -283.9109 -283.9037 -280.8962 -280.8867 -278.7057 -277.8512 -119.1284 -78.0988 -78.0788 -77.9390 -35.9043 -35.8964 -33.6086 -33.5980 -33.5713 -33.5663 -29.7672 -29.7345 -28.1540 -28.0903 -27.8540 -27.4790 -27.4192 -25.3477 -21.0746 -20.2525 -20.2432 -17.4550 -17.4441 -16.4203 -16.4135 -16.3979 -16.3830 -15.3414 -15.1257 -14.7497 -14.6634 -14.3737 -14.0523 -13.4891 -13.2338 -13.1750 -13.1701 -13.0810 -13.0072 -12.5848 -12.5838 -12.4844 -12.4484 -12.3247 -12.1551 -12.1163 -12.0802 -11.9749 -11.8847 -11.7942 -11.7348 -11.6223 -11.5524 -11.5447 -11.3537 -10.7881 -10.3511 -10.0426 -9.8634 -9.7449 -9.4906 -9.4267 -9.3366 -9.2295 -8.6851 -8.6575 -8.4082 -8.3227 -8.2325 -7.9279 -3.4292 -0.6808 -0.6332 0.0736 0.1988 0.2976 0.8598 1.6217 1.9216 2.2444 2.6245 electronvolt
chargesum: 0.0000000
charge: -0.443596 -0.439175 0.290681 -0.416817 -0.424214 0.304101 0.514157 0.514450 -0.185203 -0.179139 -0.184416 -0.184712 -0.178347 -0.185234 -0.376074 0.258906 0.250119 0.709866 -0.430500 0.256121 0.258347 -0.361409 0.244769 0.254451 -0.065143 -0.105068 -0.129337 0.144235 0.144201 0.143982
charge: 0.088479 0.088906 -0.511594 0.130747 0.127845 -0.512417 -0.596196 -0.596459 0.172411 0.185293 0.173770 0.173066 0.186476 0.172616 0.405643 -0.063220 -0.140998 -0.135954 0.353408 -0.080699 -0.080319 0.393668 -0.075469 -0.140887 -0.066705 0.145043 0.038575 0.054754 0.055269 0.054950
qa: -0.4436 -0.4392 0.2907 -0.4168 -0.4242 0.3041 0.5142 0.5145 -0.1852 -0.1791 -0.1844 -0.1847 -0.1783 -0.1852 -0.3761 0.2589 0.2501 0.7099 -0.4305 0.2561 0.2583 -0.3614 0.2448 0.2545 -0.0651 -0.1051 -0.1293 0.1442 0.1442 0.1440
va: 2.0475 2.0465 4.2408 2.0427 2.0371 4.2140 4.4442 4.4478 1.1081 1.1269 1.1096 1.1093 1.1279 1.1082 2.1480 0.9964 1.0677 2.5131 2.0259 0.9918 0.9908 2.1438 1.0130 1.0638 3.8130 3.0000 3.8261 0.9881 0.9878 0.9892
dispersion: -0.050179983 hartree
energy: -3055.126684547757 hartree
dipole: -0.408379848 -0.781284794 -1.189664642 -4.366210766 3.649578088 -0.716632679 -7.684507923 6.145814121 -1.538693802
dipolemethod: SCF
magnitude: 2.072786283 au
magnitude: 5.268604028 debye
