program: Orca
programVersion: 6.0.0
elementType: O O C O O C C C F F F F F F O H H Cu O H H O H H C N C H H H
charge: 0
multiplicity: 2
keywords: TPSS D3BJ TightOpt Freq def2-TZVPP def2/J RIJCOSX TightSCF defgrid3 CPCM(Acetonitrile)
frequency: 0.00 0.00 0.00 0.00 0.00 0.00 12.92 15.86 18.09 22.13 27.78 39.57 43.39 48.20 48.92 55.00 57.94 70.21 88.51 99.98 101.65 119.22 122.50 140.43 143.53 150.26 159.73 166.74 219.47 233.44 245.53 260.19 267.28 277.46 303.63 321.06 327.61 376.93 385.88 392.91 396.53 425.91 428.91 446.21 452.92 465.79 481.12 495.32 495.59 585.14 590.49 657.31 671.54 694.21 695.89 766.06 767.28 802.81 807.28 919.16 978.07 1004.81 1041.40 1043.85 1053.46 1055.03 1100.52 1101.39 1147.87 1152.94 1378.09 1379.46 1384.07 1439.73 1440.28 1576.64 1601.07 1602.90 1631.48 1639.38 2282.36 3001.40 3006.09 3020.01 3095.52 3098.78 3686.85 3692.91 3712.23 3779.27
frequency: 12.92 15.86 18.09 22.13 27.78 39.57 43.39 48.20 48.92 55.00 57.94 70.21 88.51 99.98 101.65 119.22 122.50 140.43 143.53 150.26 159.73 166.74 219.47 233.44 245.53 260.19 267.28 277.46 303.63 321.06 327.61 376.93 385.88 392.91 396.53 425.91 428.91 446.21 452.92 465.79 481.12 495.32 495.59 585.14 590.49 657.31 671.54 694.21 695.89 766.06 767.28 802.81 807.28 919.16 978.07 1004.81 1041.40 1043.85 1053.46 1055.03 1100.52 1101.39 1147.87 1152.94 1378.09 1379.46 1384.07 1439.73 1440.28 1576.64 1601.07 1602.90 1631.48 1639.38 2282.36 3001.40 3006.09 3020.01 3095.52 3098.78 3686.85 3692.91 3712.23 3779.27
formula: C6H9CuF6NO7
InChI: InChI=1/2C2F3O2.C2H3N.Cu.3H2O/c2*3-2(4,5)1(6)7;1-2-3;;;;/h;;1H3;;3*1H2/q2*-1;;+2;;;/rC4H4CuF6O6.C2H3N.H2O/c6-3(7,8)1(12)16-5(14,15)17-2(13)4(9,10)11;1-2-3;/h14-15H2;1H3;1H2
30 atoms
O  1.125201 1.034058 7.133909
O  3.940795 6.884409 6.303386
C  2.725368 6.781588 6.069036
O  2.817422 2.320371 7.952985
O  1.924786 5.824194 6.312413
C  2.185949 1.236369 7.749629
C  2.913173 0.003384 8.370618
C  2.009645 7.981524 5.373293
F  4.089629 -0.224711 7.727236
F  2.178861 -1.124624 8.282784
F  3.201196 0.203448 9.680614
F  1.019442 8.476217 6.160564
F  2.85534 8.99569 5.099437
F  1.440841 7.595821 4.202237
O  0.501807 3.530088 6.698243
H  0.292459 3.772371 5.780616
H  0.562786 2.52473 6.730679
Cu 2.407327 4.067947 7.095933
O  1.955167 4.879817 9.341909
H  1.339401 5.628719 9.299888
H  1.470448 4.190619 9.823149
O  4.294135 4.62535 7.584062
H  4.259584 4.789764 8.543029
H  4.344042 5.535086 7.153915
C  3.260635 2.162288 4.490976
N  3.130809 3.186691 5.018394
C  3.419775 0.869213 3.850811
H  2.663463 0.749301 3.070759
H  4.415845 0.798618 3.406069
H  3.298898 0.08029 4.598477
totalener: -3055.91135890793703 hartree
nucrepener: 2504.02583970451269 hartree
electener: -5559.89824866141316 hartree
oneelecener: -9232.23686383229506 hartree
twoeener: 3672.33861517088189 hartree
cpcmener: -0.03894995103672 hartree
kineticenergy: 3048.03113879998909 hartree
exchangeener: -226.189503644341 hartree
correlationener: -6.949901644396 hartree
xcener: -233.139405288736 hartree
s2: 0.751211
dispersion: -0.037727762 hartree
dispersion: -0.037728379 hartree
dispersion: -0.037747520 hartree
dispersion: -0.037749920 hartree
dispersion: -0.037774387 hartree
dispersion: -0.037774996 hartree
dispersion: -0.037782990 hartree
dispersion: -0.037797044 hartree
s2: 0.751212
dispersion: -0.037844623 hartree
dispersion: -0.037907067 hartree
dispersion: -0.037964514 hartree
s2: 0.751213
dispersion: -0.038162799 hartree
dispersion: -0.038141491 hartree
dispersion: -0.038171676 hartree
s2: 0.751215
dispersion: -0.038320560 hartree
s2: 0.751218
dispersion: -0.038405778 hartree
s2: 0.751221
dispersion: -0.038437331 hartree
s2: 0.751227
dispersion: -0.038643771 hartree
s2: 0.751228
dispersion: -0.038608231 hartree
s2: 0.751232
dispersion: -0.038671695 hartree
s2: 0.751233
dispersion: -0.038653991 hartree
s2: 0.751235
dispersion: -0.038693519 hartree
s2: 0.751237
dispersion: -0.038769275 hartree
s2: 0.751239
dispersion: -0.038818706 hartree
s2: 0.751244
dispersion: -0.038960295 hartree
dispersion: -0.038952074 hartree
s2: 0.751243
dispersion: -0.038923403 hartree
dispersion: -0.038949594 hartree
s2: 0.751247
dispersion: -0.039018798 hartree
s2: 0.751246
dispersion: -0.038971073 hartree
dispersion: -0.038929086 hartree
dispersion: -0.038946367 hartree
s2: 0.751245
dispersion: -0.038971603 hartree
dispersion: -0.038977274 hartree
dispersion: -0.038982385 hartree
dispersion: -0.038980073 hartree
s2: 0.751242
dispersion: -0.038975480 hartree
s2: 0.751241
dispersion: -0.038974543 hartree
dispersion: -0.038976710 hartree
dispersion: -0.038985127 hartree
s2: 0.751238
dispersion: -0.038995051 hartree
dispersion: -0.038999070 hartree
dispersion: -0.038999398 hartree
dispersion: -0.038995054 hartree
dispersion: -0.038992636 hartree
dispersion: -0.038991162 hartree
dispersion: -0.038990458 hartree
dispersion: -0.038992494 hartree
dispersion: -0.038994576 hartree
dispersion: -0.038996580 hartree
elementType: O C F H Cu N
energy: -8766.8045 -1047.1405 -917.1058 -917.0798 -916.8043 -665.2965 -665.2911 -665.2787 -665.2781 -665.2699 -665.2698 -514.8764 -514.7983 -514.4730 -514.4551 -514.3609 -514.0283 -514.0242 -384.1111 -278.5708 -278.5672 -275.5684 -275.5664 -273.3634 -272.8598 -115.6535 -75.5830 -75.4631 -74.2252 -33.6507 -33.6454 -31.4402 -31.4341 -31.3926 -31.3867 -27.8961 -27.8619 -26.5106 -26.4617 -26.0859 -25.7003 -25.6505 -23.4614 -19.5640 -18.6103 -18.6005 -15.8831 -15.8679 -14.8141 -14.8074 -14.8018 -14.7834 -14.0401 -13.8450 -13.4362 -13.2825 -13.0019 -12.8299 -12.1610 -11.8526 -11.6075 -11.5423 -11.4199 -11.3941 -11.3701 -11.3566 -11.2929 -11.1504 -11.0851 -10.7128 -10.6318 -10.5921 -10.4297 -10.4255 -10.2738 -10.2426 -10.2333 -9.9658 -9.8833 -9.8754 -9.4539 -8.8381 -8.7675 -8.6429 -8.4687 -8.1899 -8.1300 -7.9479 -7.7085 -7.5686 -7.4207 -7.0807 -7.0270 -7.0075 -6.3775 -6.1762 -1.4815 -1.4196 -0.5633 -0.4243 -0.2543 0.6640 1.1923 1.4362 1.9854 2.1408 2.3660 electronvolt
energy: -8766.7989 -1046.7268 -916.6812 -916.6538 -916.6460 -665.2937 -665.2881 -665.2783 -665.2781 -665.2698 -665.2695 -514.8121 -514.7323 -514.3997 -514.3846 -514.3618 -514.0282 -514.0243 -384.1111 -278.5638 -278.5599 -275.5705 -275.5682 -273.3649 -272.8597 -114.7189 -74.3146 -74.2776 -73.9308 -33.6479 -33.6425 -31.4369 -31.4304 -31.3918 -31.3862 -27.8418 -27.8097 -26.3995 -26.3501 -26.0826 -25.6355 -25.5841 -23.4621 -19.5643 -18.5852 -18.5763 -15.8547 -15.8455 -14.8108 -14.8043 -14.7928 -14.7766 -13.9986 -13.8125 -13.4332 -13.2089 -12.9572 -12.8284 -12.1012 -11.8035 -11.5994 -11.5354 -11.4172 -11.3851 -11.3684 -11.3510 -11.1489 -11.0761 -10.8829 -10.6584 -10.5610 -10.5247 -10.4212 -10.4053 -10.2468 -10.2341 -10.2046 -9.9339 -9.8820 -9.8740 -9.2003 -8.6973 -8.6288 -8.4096 -8.2896 -8.1240 -7.9764 -7.8419 -7.5433 -7.4825 -7.0736 -7.0085 -6.8759 -6.7587 -5.8905 -4.6366 -1.4714 -1.4043 -0.5521 -0.4235 -0.2377 0.6682 1.2114 1.4497 1.9923 2.1615 electronvolt
chargesum: -0.0000000
charge: -0.420222 -0.410563 0.281208 -0.378508 -0.387876 0.318617 0.422885 0.419357 -0.159034 -0.151555 -0.154695 -0.156137 -0.148918 -0.155577 -0.356900 0.271835 0.250020 0.548539 -0.432456 0.262540 0.265115 -0.347982 0.257059 0.253233 -0.139172 -0.052065 -0.031680 0.110988 0.111028 0.110916
charge: 0.108155 0.108258 -0.527544 0.155096 0.152175 -0.530556 -0.625287 -0.625210 0.181807 0.197169 0.186017 0.182913 0.197511 0.183589 0.418574 -0.062039 -0.143798 -0.200651 0.361011 -0.079290 -0.079285 0.412048 -0.067476 -0.144241 -0.083198 0.128338 0.041947 0.052023 0.052039 0.049907
qa: -0.4202 -0.4106 0.2812 -0.3785 -0.3879 0.3186 0.4229 0.4194 -0.1590 -0.1516 -0.1547 -0.1561 -0.1489 -0.1556 -0.3569 0.2718 0.2500 0.5485 -0.4325 0.2625 0.2651 -0.3480 0.2571 0.2532 -0.1392 -0.0521 -0.0317 0.1110 0.1110 0.1109
va: 2.0842 2.0927 4.2415 2.1032 2.0962 4.1697 4.5255 4.5325 1.1438 1.1682 1.1546 1.1474 1.1693 1.1491 2.1667 0.9820 1.0694 2.6098 2.0218 0.9851 0.9829 2.1735 0.9976 1.0675 3.9010 2.9619 3.9049 1.0052 1.0044 1.0151
dispersion: -0.038996295 hartree
energy: -3055.949559284924 hartree
dipole: 0.819513918 -1.619460806 -0.799946888 -8.043205570 6.631870770 -1.411334800 -4.446142100 4.092392437 -0.353749663
dipolemethod: SCF
magnitude: 1.660397472 au
magnitude: 4.220394974 debye
temp: 298.15 k
press: 1.00 atm
zeropoint: 0.17208659 hartree
thermalvibcorrection: 0.02611630 hartree
thermalrotcorrection: 0.00141627 hartree
thermaltrasncorrection: 0.00141627 hartree
thermaltotal: -3055.74852385 hartree
thermalcorr: 0.02894884 hartree
nonthermalcorr: 0.17208659 hartree
totalcorr: 0.20103544 hartree
thermalcorrenthalpy: 0.00094421 hartree
totalenthalpy: -3055.74757964 hartree
vibrat: 0.04996116 hartree
rotat: 0.01662601 hartree
transl: 0.02077929 hartree
total: 0.08802091 hartree
totalentropycorr: -0.08802091 hartree
gibbsenthalpy: -3055.83560055 hartree
gibbsminuselec: 0.11395873 hartree
