program: Orca
programVersion: 6.0.0
elementType: O O C O O C C C F F F F F F O H H Cu O H H O H H C N C H H H
charge: 0
multiplicity: 2
keywords: TPSS D3BJ TightOpt Freq def2-TZVPP def2/J RIJCOSX TightSCF defgrid3 CPCM(Acetonitrile)
frequency: 0.00 0.00 0.00 0.00 0.00 0.00 13.04 15.28 16.41 20.67 29.20 39.68 42.52 43.49 50.29 55.17 57.57 71.55 87.68 97.38 100.96 121.58 122.10 131.76 143.32 150.72 159.78 167.21 219.37 233.60 245.54 259.91 266.85 277.70 304.07 321.05 327.95 378.35 386.40 393.01 394.98 425.99 428.95 447.97 454.01 466.20 481.22 495.44 495.74 585.11 590.52 660.23 674.07 694.29 695.91 766.14 767.40 802.75 807.28 918.86 977.19 1004.94 1040.25 1042.56 1052.75 1055.14 1100.57 1102.08 1147.85 1152.94 1378.12 1379.57 1382.64 1438.77 1439.12 1576.59 1600.76 1602.69 1631.45 1639.10 2281.52 3002.07 3006.24 3020.20 3096.98 3097.43 3687.10 3692.58 3712.76 3778.75
frequency: 13.04 15.28 16.41 20.67 29.20 39.68 42.52 43.49 50.29 55.17 57.57 71.55 87.68 97.38 100.96 121.58 122.10 131.76 143.32 150.72 159.78 167.21 219.37 233.60 245.54 259.91 266.85 277.70 304.07 321.05 327.95 378.35 386.40 393.01 394.98 425.99 428.95 447.97 454.01 466.20 481.22 495.44 495.74 585.11 590.52 660.23 674.07 694.29 695.91 766.14 767.40 802.75 807.28 918.86 977.19 1004.94 1040.25 1042.56 1052.75 1055.14 1100.57 1102.08 1147.85 1152.94 1378.12 1379.57 1382.64 1438.77 1439.12 1576.59 1600.76 1602.69 1631.45 1639.10 2281.52 3002.07 3006.24 3020.20 3096.98 3097.43 3687.10 3692.58 3712.76 3778.75
formula: C6H9CuF6NO7
InChI: InChI=1/2C2F3O2.C2H3N.Cu.3H2O/c2*3-2(4,5)1(6)7;1-2-3;;;;/h;;1H3;;3*1H2/q2*-1;;+2;;;/rC4H4CuF6O6.C2H3N.H2O/c6-3(7,8)1(12)16-5(14,15)17-2(13)4(9,10)11;1-2-3;/h14-15H2;1H3;1H2
30 atoms
O  1.165551 1.020709 7.067014
O  3.929833 6.900015 6.353276
C  2.719943 6.789131 6.095406
O  2.811483 2.319285 7.957773
O  1.921816 5.825207 6.320798
C  2.204491 1.228986 7.717221
C  2.936446 -0.005166 8.329898
C  2.008791 7.985684 5.38922
F  4.106445 -0.229897 7.672477
F  2.2017 -1.133154 8.244297
F  3.23821 0.188775 9.637022
F  0.998639 8.469552 6.157618
F  2.851637 9.007614 5.136195
F  1.467341 7.599478 4.205445
O  0.514595 3.513733 6.657476
H  0.32213 3.769012 5.73967
H  0.58926 2.508946 6.674385
Cu 2.40306 4.069938 7.106625
O  1.887749 4.865449 9.340971
H  1.266613 5.608969 9.284365
H  1.395921 4.170344 9.806289
O  4.273865 4.641334 7.637153
H  4.21848 4.803523 8.595523
H  4.326007 5.552274 7.209812
C  3.293159 2.176218 4.509882
N  3.18113 3.204989 5.033096
C  3.427705 0.877847 3.874768
H  3.73419 1.004296 2.833115
H  4.180281 0.289778 4.406978
H  2.467757 0.355759 3.911274
totalener: -3055.91046721019075 hartree
nucrepener: 2521.15857288728375 hartree
electener: -5577.03321993264490 hartree
oneelecener: -9266.07602601763938 hartree
twoeener: 3689.04280608499448 hartree
cpcmener: -0.03582016482928 hartree
kineticenergy: 3048.03207232069508 hartree
exchangeener: -226.187815718319 hartree
correlationener: -6.950322811999 hartree
xcener: -233.138138530318 hartree
s2: 0.751239
dispersion: -0.039066378 hartree
dispersion: -0.039064800 hartree
s2: 0.751238
dispersion: -0.039074737 hartree
dispersion: -0.039074014 hartree
dispersion: -0.039073635 hartree
dispersion: -0.039088077 hartree
dispersion: -0.039090031 hartree
dispersion: -0.039090164 hartree
dispersion: -0.039096105 hartree
dispersion: -0.039108876 hartree
dispersion: -0.039109358 hartree
dispersion: -0.039107695 hartree
dispersion: -0.039104388 hartree
dispersion: -0.039101277 hartree
dispersion: -0.039098928 hartree
dispersion: -0.039099761 hartree
dispersion: -0.039103470 hartree
dispersion: -0.039108762 hartree
dispersion: -0.039108718 hartree
dispersion: -0.039106934 hartree
dispersion: -0.039105510 hartree
dispersion: -0.039104565 hartree
dispersion: -0.039103198 hartree
dispersion: -0.039101857 hartree
dispersion: -0.039102277 hartree
elementType: O C F H Cu N
energy: -8766.8089 -1047.1448 -917.1101 -917.0842 -916.8086 -665.2969 -665.2913 -665.2807 -665.2805 -665.2706 -665.2704 -514.8804 -514.8020 -514.4758 -514.4595 -514.3662 -514.0329 -514.0263 -384.1039 -278.5726 -278.5681 -275.5703 -275.5697 -273.3567 -272.8571 -115.6575 -75.5863 -75.4668 -74.2300 -33.6522 -33.6459 -31.4419 -31.4345 -31.3939 -31.3874 -27.8992 -27.8649 -26.5142 -26.4643 -26.0906 -25.7030 -25.6532 -23.4552 -19.5607 -18.6127 -18.6019 -15.8850 -15.8694 -14.8160 -14.8080 -14.8029 -14.7843 -14.0440 -13.8470 -13.4394 -13.2845 -13.0039 -12.8248 -12.1651 -11.8557 -11.6091 -11.5431 -11.4139 -11.3940 -11.3757 -11.3504 -11.2960 -11.1512 -11.0959 -10.7143 -10.6305 -10.5935 -10.4308 -10.4262 -10.2741 -10.2438 -10.2310 -9.9524 -9.8851 -9.8757 -9.4580 -8.8441 -8.7685 -8.6346 -8.4624 -8.1957 -8.1369 -7.9543 -7.7113 -7.5701 -7.4249 -7.0861 -7.0297 -7.0093 -6.3842 -6.1782 -1.4930 -1.4221 -0.5520 -0.4254 -0.2507 0.6432 1.1970 1.4364 2.0091 2.1814 2.2819 electronvolt
energy: -8766.8033 -1046.7312 -916.6855 -916.6582 -916.6504 -665.2942 -665.2884 -665.2808 -665.2799 -665.2704 -665.2702 -514.8161 -514.7360 -514.4024 -514.3890 -514.3671 -514.0328 -514.0264 -384.1039 -278.5657 -278.5608 -275.5724 -275.5715 -273.3582 -272.8570 -114.7231 -74.3183 -74.2814 -73.9356 -33.6494 -33.6430 -31.4387 -31.4308 -31.3930 -31.3869 -27.8449 -27.8126 -26.4031 -26.3526 -26.0873 -25.6382 -25.5867 -23.4558 -19.5610 -18.5877 -18.5775 -15.8568 -15.8467 -14.8126 -14.8050 -14.7941 -14.7775 -14.0025 -13.8145 -13.4364 -13.2108 -12.9592 -12.8235 -12.1051 -11.8065 -11.6006 -11.5360 -11.4108 -11.3846 -11.3740 -11.3456 -11.1500 -11.0869 -10.8853 -10.6595 -10.5617 -10.5239 -10.4221 -10.4061 -10.2473 -10.2355 -10.2035 -9.9211 -9.8837 -9.8742 -9.2037 -8.6993 -8.6221 -8.4055 -8.2907 -8.1298 -7.9834 -7.8491 -7.5454 -7.4836 -7.0781 -7.0107 -6.8792 -6.7628 -5.8981 -4.6386 -1.4828 -1.4069 -0.5400 -0.4246 -0.2348 0.6471 1.2161 1.4497 2.0170 2.2079 electronvolt
chargesum: 0.0000000
charge: -0.419432 -0.410489 0.281842 -0.378407 -0.387462 0.320529 0.416508 0.419392 -0.157795 -0.150005 -0.153878 -0.156100 -0.148885 -0.155543 -0.356495 0.272014 0.250939 0.547716 -0.432488 0.262588 0.265016 -0.347079 0.257045 0.253279 -0.141532 -0.054220 -0.024443 0.112416 0.107246 0.107721
charge: 0.108705 0.108418 -0.527402 0.155304 0.152119 -0.530504 -0.625180 -0.625203 0.181331 0.197106 0.186905 0.182953 0.197532 0.183630 0.418870 -0.062002 -0.143760 -0.199657 0.361362 -0.079067 -0.079049 0.412255 -0.067199 -0.144097 -0.084770 0.126354 0.041011 0.051542 0.051203 0.051289
qa: -0.4194 -0.4105 0.2818 -0.3784 -0.3875 0.3205 0.4165 0.4194 -0.1578 -0.1500 -0.1539 -0.1561 -0.1489 -0.1555 -0.3565 0.2720 0.2509 0.5477 -0.4325 0.2626 0.2650 -0.3471 0.2570 0.2533 -0.1415 -0.0542 -0.0244 0.1124 0.1072 0.1077
va: 2.0840 2.0929 4.2405 2.1043 2.0967 4.1669 4.5325 4.5327 1.1443 1.1686 1.1548 1.1475 1.1694 1.1492 2.1672 0.9820 1.0683 2.6121 2.0219 0.9850 0.9830 2.1750 0.9974 1.0676 3.9080 2.9633 3.9055 1.0027 1.0110 1.0113
dispersion: -0.039103610 hartree
energy: -3055.949549240665 hartree
dipole: 0.641405259 -1.507613722 -0.866208463 -8.041621451 6.634879126 -1.406742325 -4.361447827 4.031011154 -0.330436673
dipolemethod: SCF
magnitude: 1.684763920 au
magnitude: 4.282329563 debye
temp: 298.15 k
press: 1.00 atm
zeropoint: 0.17205855 hartree
thermalvibcorrection: 0.02613996 hartree
thermalrotcorrection: 0.00141627 hartree
thermaltrasncorrection: 0.00141627 hartree
thermaltotal: -3055.74851818 hartree
thermalcorr: 0.02897250 hartree
nonthermalcorr: 0.17205855 hartree
totalcorr: 0.20103106 hartree
thermalcorrenthalpy: 0.00094421 hartree
totalenthalpy: -3055.74757398 hartree
vibrat: 0.05009984 hartree
rotat: 0.01662220 hartree
transl: 0.02077929 hartree
total: 0.08815578 hartree
totalentropycorr: -0.08815578 hartree
gibbsenthalpy: -3055.83572976 hartree
gibbsminuselec: 0.11381948 hartree
