program: Orca
programVersion: 6.0.0
elementType: O O C O O C C C F F F F F F O H H O H H O H H Cu
charge: 0
multiplicity: 2
keywords: b3lyp d3bj def2-TZVPP def2/J RIJCOSX TightSCF defgrid3 CPCM(Acetonitrile)
formula: C4H6CuF6O7
InChI: InChI=1/2C2F3O2.Cu.3H2O/c2*3-2(4,5)1(6)7;;;;/h;;;3*1H2/q2*-1;+2;;;/rC4H4CuF6O6.H2O/c6-3(7,8)1(12)16-5(14,15)17-2(13)4(9,10)11;/h14-15H2;1H2
24 atoms
O  1.037531 0.867574 7.934984
O  3.756914 6.707888 6.557022
C  2.673061 6.413101 6.028276
O  2.879085 2.166723 8.265705
O  1.996343 5.336868 6.100559
C  2.172452 1.117341 8.37914
C  2.844647 -0.0311 9.19417
C  1.982781 7.479493 5.122077
F  3.037508 -1.116482 8.401026
F  2.045393 -0.416264 10.220276
F  4.04119 0.309054 9.715756
F  0.741518 7.777997 5.583286
F  2.682306 8.630407 5.062176
F  1.843794 7.017365 3.853025
O  0.529906 3.19424 6.904752
H  0.354441 3.215197 5.948839
H  0.549618 2.22418 7.186802
O  1.71191 4.913268 9.218019
H  2.146622 5.779214 9.281643
H  0.768227 5.123509 9.128297
O  4.315893 4.331266 7.469263
H  4.606529 4.249075 8.393179
H  4.296171 5.313272 7.243714
Cu 2.391843 3.808423 7.28822
elementType: O C F H Cu
totalener: -2922.33504018036683 hartree
nucrepener: 2029.40637817767561 hartree
electener: -4951.70240139202360 hartree
oneelecener: -8102.80459736900320 hartree
twoeener: 3151.10219597697960 hartree
cpcmener: -0.03901760830567 hartree
kineticenergy: 2915.05837271517066 hartree
exchangeener: -164.627753064276 hartree
correlationener: -7.660918163450 hartree
xcener: -172.288671227727 hartree
s2: 0.751809
energy: -8792.5451 -1059.4435 -929.0029 -928.9856 -928.6515 -672.8126 -672.8087 -672.8025 -672.8007 -672.7932 -672.7915 -521.5485 -521.5285 -521.1287 -521.1189 -521.0852 -520.7256 -520.6807 -283.9691 -283.9649 -280.9945 -280.9912 -120.6015 -80.1054 -80.0461 -78.5761 -35.9476 -35.9410 -33.6522 -33.6432 -33.6087 -33.6030 -29.9366 -29.8980 -28.4052 -28.3841 -28.0441 -27.6577 -27.5940 -20.3343 -20.3229 -17.5610 -17.5377 -16.4633 -16.4583 -16.4533 -16.4343 -15.6261 -15.3942 -14.9385 -14.8479 -14.5576 -13.7892 -13.5084 -13.4155 -13.2187 -13.2086 -13.1151 -13.0424 -12.6601 -12.6275 -12.2336 -12.1970 -12.1494 -12.1258 -12.1138 -11.9417 -11.8120 -11.7449 -11.5878 -11.5799 -11.4000 -11.0493 -10.6482 -10.4857 -10.2650 -10.0541 -9.8205 -9.0627 -8.9801 -8.6651 -8.6087 -8.4575 -8.3496 -7.9802 -0.8013 -0.7084 -0.1594 1.0444 1.3532 2.4348 2.5532 2.6555 2.9367 3.1194 3.2037 electronvolt
energy: -8792.5342 -1058.8284 -928.4865 -928.3212 -928.3170 -672.8108 -672.8090 -672.8027 -672.8006 -672.7923 -672.7903 -521.4878 -521.4676 -521.1201 -521.0650 -521.0212 -520.7266 -520.6819 -283.9641 -283.9597 -280.9961 -280.9928 -119.3466 -78.3000 -78.2863 -78.1807 -35.9455 -35.9390 -33.6495 -33.6425 -33.6085 -33.6006 -29.8824 -29.8462 -28.2824 -28.2606 -28.0428 -27.5914 -27.5253 -20.3091 -20.3015 -17.5190 -17.5124 -16.4595 -16.4510 -16.4472 -16.4284 -15.5423 -15.3580 -14.8666 -14.7757 -14.4932 -13.6768 -13.3653 -13.2147 -13.2049 -13.1100 -13.0472 -12.6358 -12.6147 -12.4101 -12.2010 -12.1407 -12.1165 -12.0381 -12.0085 -11.8880 -11.7663 -11.6864 -11.5863 -11.5783 -10.9486 -10.5584 -10.2155 -10.0316 -9.8662 -9.5180 -9.3508 -8.8964 -8.7999 -8.5176 -8.4080 -8.3442 -8.2658 -3.5334 -0.7924 -0.6939 -0.1292 1.0534 1.3653 2.4436 2.5687 2.6975 2.9480 3.1337 electronvolt
chargesum: -0.0000000
charge: -0.444730 -0.436177 0.326136 -0.404334 -0.421469 0.311304 0.522169 0.519920 -0.184278 -0.183059 -0.178452 -0.183307 -0.177016 -0.183499 -0.362411 0.262783 0.259934 -0.414106 0.259810 0.257401 -0.355952 0.261294 0.256899 0.691141
charge: 0.094621 0.095428 -0.506687 0.131879 0.124222 -0.503558 -0.596518 -0.597321 0.174328 0.176299 0.186782 0.174675 0.188509 0.174522 0.409051 -0.058239 -0.141802 0.368115 -0.072833 -0.072560 0.410407 -0.058039 -0.137679 0.036399
qa: -0.4447 -0.4362 0.3261 -0.4043 -0.4215 0.3113 0.5222 0.5199 -0.1843 -0.1831 -0.1785 -0.1833 -0.1770 -0.1835 -0.3624 0.2628 0.2599 -0.4141 0.2598 0.2574 -0.3560 0.2613 0.2569 0.6911
va: 2.0604 2.0613 4.1738 2.0588 2.0464 4.1947 4.4402 4.4495 1.1105 1.1130 1.1262 1.1110 1.1299 1.1111 2.1814 0.9925 1.0589 2.0379 0.9912 0.9921 2.1881 0.9918 1.0589 2.5265
dispersion: -0.038489530 hartree
energy: -2922.373529709868 hartree
dipole: -1.688531338 1.330031329 -0.358500009 3.499629397 -2.371913798 1.127715598 4.151271356 -3.646607544 0.504663812
dipolemethod: SCF
magnitude: 1.286448713 au
magnitude: 3.269892765 debye
