program: Orca
programVersion: 6.0.0
elementType: O O C O O C C C F F F F F F O H H O H H O H H Cu
charge: 0
multiplicity: 2
keywords: TPSS D3BJ TightOpt Freq def2-TZVPP def2/J RIJCOSX TightSCF defgrid3 CPCM(Acetonitrile)
frequency: 0.00 0.00 0.00 0.00 0.00 0.00 8.09 14.91 17.69 29.97 35.23 46.44 50.08 63.01 85.96 98.10 100.79 113.65 145.86 160.86 164.52 189.07 221.32 233.49 246.60 258.18 264.74 289.85 320.72 335.25 380.92 397.57 427.01 431.62 437.67 438.73 457.53 470.86 486.37 494.57 495.50 586.48 592.51 660.86 672.91 695.46 697.30 765.83 766.74 806.31 810.34 970.61 997.18 1057.03 1057.33 1102.32 1102.52 1146.40 1151.69 1376.80 1383.35 1567.28 1574.51 1606.25 1633.37 1642.06 2950.08 3001.69 3686.10 3711.30 3713.30 3768.84
frequency: 8.09 14.91 17.69 29.97 35.23 46.44 50.08 63.01 85.96 98.10 100.79 113.65 145.86 160.86 164.52 189.07 221.32 233.49 246.60 258.18 264.74 289.85 320.72 335.25 380.92 397.57 427.01 431.62 437.67 438.73 457.53 470.86 486.37 494.57 495.50 586.48 592.51 660.86 672.91 695.46 697.30 765.83 766.74 806.31 810.34 970.61 997.18 1057.03 1057.33 1102.32 1102.52 1146.40 1151.69 1376.80 1383.35 1567.28 1574.51 1606.25 1633.37 1642.06 2950.08 3001.69 3686.10 3711.30 3713.30 3768.84
formula: C4H6CuF6O7
InChI: InChI=1/2C2F3O2.Cu.3H2O/c2*3-2(4,5)1(6)7;;;;/h;;;3*1H2/q2*-1;+2;;;/rC4H4CuF6O6.H2O/c6-3(7,8)1(12)16-5(14,15)17-2(13)4(9,10)11;/h14-15H2;1H2
24 atoms
O  1.037531 0.867574 7.934984
O  3.756914 6.707888 6.557022
C  2.673061 6.413101 6.028276
O  2.879085 2.166723 8.265705
O  1.996343 5.336868 6.100559
C  2.172452 1.117341 8.37914
C  2.844647 -0.0311 9.19417
C  1.982781 7.479493 5.122077
F  3.037508 -1.116482 8.401026
F  2.045393 -0.416264 10.220276
F  4.04119 0.309054 9.715756
F  0.741518 7.777997 5.583286
F  2.682306 8.630407 5.062176
F  1.843794 7.017365 3.853025
O  0.529906 3.19424 6.904752
H  0.354441 3.215197 5.948839
H  0.549618 2.22418 7.186802
O  1.71191 4.913268 9.218019
H  2.146622 5.779214 9.281643
H  0.768227 5.123509 9.128297
O  4.315893 4.331266 7.469263
H  4.606529 4.249075 8.393179
H  4.296171 5.313272 7.243714
Cu 2.391843 3.808423 7.28822
totalener: -2923.07036637263718 hartree
nucrepener: 2029.38821538624620 hartree
electener: -4952.42261535605576 hartree
oneelecener: -8103.21219365511297 hartree
twoeener: 3150.78957829905721 hartree
cpcmener: -0.03596640282708 hartree
kineticenergy: 2915.79035048356945 hartree
exchangeener: -208.035271795010 hartree
correlationener: -6.236625987328 hartree
xcener: -214.271897782339 hartree
s2: 0.751324
dispersion: -0.028587142 hartree
elementType: O C F H Cu
energy: -8766.9952 -1047.3553 -917.3128 -917.2970 -917.0228 -665.3244 -665.3106 -665.3027 -665.3025 -665.2990 -665.2986 -515.0170 -515.0015 -514.6148 -514.5762 -514.5042 -514.1067 -514.0704 -278.6161 -278.6127 -275.6525 -275.6497 -115.8548 -75.7387 -75.6787 -74.4576 -33.6836 -33.6772 -31.4707 -31.4590 -31.4228 -31.4207 -27.9902 -27.9513 -26.6338 -26.6151 -26.2268 -25.7906 -25.7361 -18.6578 -18.6483 -15.9353 -15.9245 -14.8482 -14.8421 -14.8384 -14.8166 -14.2157 -14.0418 -13.5367 -13.3842 -13.1141 -12.3125 -11.9762 -11.5865 -11.5770 -11.5562 -11.4256 -11.3632 -11.2089 -11.1985 -10.7984 -10.6728 -10.6384 -10.4600 -10.4506 -10.3705 -10.2654 -10.2236 -9.9068 -9.8991 -9.6022 -8.9196 -8.9019 -8.5486 -8.2403 -8.0644 -7.8124 -7.7986 -7.5691 -7.1744 -7.1145 -7.1005 -6.7437 -6.2783 -1.5565 -1.4667 -0.4894 0.7018 0.9957 2.0504 2.1640 2.2053 2.4182 2.4681 2.7003 electronvolt
energy: -8766.9898 -1046.9415 -916.8992 -916.8680 -916.8562 -665.3214 -665.3109 -665.3027 -665.3022 -665.2972 -665.2966 -514.9507 -514.9349 -514.5417 -514.5051 -514.5029 -514.1068 -514.0707 -278.6090 -278.6053 -275.6546 -275.6515 -114.9223 -74.4962 -74.4744 -74.1621 -33.6807 -33.6743 -31.4670 -31.4578 -31.4223 -31.4172 -27.9338 -27.8976 -26.5199 -26.5001 -26.2263 -25.7250 -25.6690 -18.6317 -18.6245 -15.9055 -15.9022 -14.8424 -14.8354 -14.8328 -14.8102 -14.1710 -14.0082 -13.5346 -13.3074 -13.0651 -12.2416 -11.9225 -11.5780 -11.5682 -11.4238 -11.4014 -11.1971 -11.1880 -11.0398 -10.7191 -10.6252 -10.5852 -10.4529 -10.4434 -10.3454 -10.2560 -10.2103 -9.9054 -9.8982 -9.3216 -8.7266 -8.5068 -8.4075 -8.0879 -7.9073 -7.7448 -7.6163 -7.2014 -7.1028 -6.9917 -6.8695 -6.2915 -4.7332 -1.5468 -1.4508 -0.4580 0.7089 1.0132 2.0778 2.1866 2.2200 2.4342 2.4904 electronvolt
chargesum: -0.0000000
charge: -0.414652 -0.408461 0.318692 -0.366217 -0.381564 0.300750 0.427006 0.424475 -0.154771 -0.153665 -0.150000 -0.154397 -0.147894 -0.154523 -0.357538 0.274080 0.256604 -0.423287 0.269153 0.267118 -0.350867 0.273178 0.254194 0.552586
charge: 0.111454 0.111393 -0.524611 0.153836 0.147045 -0.521646 -0.625235 -0.625986 0.185090 0.187028 0.196546 0.184984 0.199069 0.184861 0.421089 -0.057383 -0.144500 0.371543 -0.073717 -0.073485 0.422230 -0.057097 -0.140436 -0.032073
qa: -0.4147 -0.4085 0.3187 -0.3662 -0.3816 0.3008 0.4270 0.4245 -0.1548 -0.1537 -0.1500 -0.1544 -0.1479 -0.1545 -0.3575 0.2741 0.2566 -0.4233 0.2692 0.2671 -0.3509 0.2732 0.2542 0.5526
va: 2.1053 2.1042 4.1702 2.1236 2.1116 4.1935 4.5289 4.5366 1.1505 1.1530 1.1658 1.1505 1.1709 1.1506 2.1949 0.9814 1.0640 2.0282 0.9815 0.9820 2.2000 0.9802 1.0630 2.5387
dispersion: -0.028588581 hartree
energy: -2923.098953019903 hartree
dipole: -1.688533280 1.325095310 -0.363437970 3.499629442 -2.386950084 1.112679358 4.151270200 -3.636546445 0.514723755
dipolemethod: SCF
magnitude: 1.278703662 au
magnitude: 3.250206411 debye
temp: 298.15 k
press: 1.00 atm
zeropoint: 0.12681984 hartree
thermalvibcorrection: 0.02040973 hartree
thermalrotcorrection: 0.00141627 hartree
thermaltrasncorrection: 0.00141627 hartree
thermaltotal: -2922.94889091 hartree
thermalcorr: 0.02324227 hartree
nonthermalcorr: 0.12681984 hartree
totalcorr: 0.15006211 hartree
thermalcorrenthalpy: 0.00094421 hartree
totalenthalpy: -2922.94794670 hartree
vibrat: 0.03876607 hartree
rotat: 0.01627909 hartree
transl: 0.02061945 hartree
total: 0.07631906 hartree
totalentropycorr: -0.07631906 hartree
gibbsenthalpy: -2923.02426577 hartree
gibbsminuselec: 0.07468725 hartree
