program: Orca
programVersion: 6.0.0
elementType: O O C O O C C C F F F F F F Cu C N C N C N C N C H H H C H H H C H H H C H H H
charge: 0
multiplicity: 2
keywords: TPSS D3BJ TightOpt Freq def2-TZVPP def2/J RIJCOSX TightSCF defgrid3 CPCM(Acetonitrile)
formula: C12H12CuF6N4O4
InChI: InChI=1/2C2F3O2.4C2H3N.Cu/c2*3-2(4,5)1(6)7;4*1-2-3;/h;;4*1H3;/q2*-1;;;;;+2/rC10H9CuF6N3O4.C2H3N/c1-4-18-11(19-5-2,20-6-3,23-7(21)9(12,13)14)24-8(22)10(15,16)17;1-2-3/h1-3H3;1H3
39 atoms
O  0.056851 2.073529 9.527175
O  2.882452 7.229239 8.120393
C  2.084483 6.953434 7.228635
O  2.237997 2.613738 9.131079
O  1.497534 5.848898 6.946242
C  1.272023 1.915784 9.605297
C  1.824101 0.67724 10.390151
C  1.652772 8.076465 6.225241
F  2.533693 -0.147254 9.572429
F  0.835939 -0.060653 10.941398
F  2.655256 1.053714 11.398276
F  0.314287 8.309854 6.292958
F  2.27621 9.249347 6.470234
F  1.93478 7.731645 4.940237
Cu 1.84911 4.243453 8.062178
C  0.483122 5.607608 10.539799
N  0.991555 5.113952 9.628923
C  4.851788 4.159357 6.962166
N  3.803014 4.209914 7.442354
C  4.084933 1.878346 3.270885
N  3.74788 1.98771 4.37561
C  0.512195 2.433395 5.766648
N  0.904996 3.117584 6.610099
C  0.019367 1.571299 4.710845
H  -0.729931 2.106083 4.121649
H  0.853334 1.281006 4.066281
H  -0.431431 0.678527 5.151897
C  -0.157116 6.22576 11.68275
H  -0.778867 5.485545 12.193482
H  0.607405 6.598616 12.369503
H  -0.780703 7.057181 11.343547
C  6.165328 4.095994 6.352898
H  6.852494 3.568389 7.019749
H  6.092954 3.559037 5.402929
H  6.534033 5.109692 6.175428
C  4.504698 1.742754 1.884233
H  4.981152 2.668655 1.551154
H  5.216695 0.918103 1.7938
H  3.634579 1.538365 1.254971
totalener: -3224.96450839754243 hartree
nucrepener: 3279.57142003072522 hartree
electener: -6504.47432944127740 hartree
twoeener: 4503.01493578909049 hartree
cpcmener: -0.06159898699064 hartree
kineticenergy: 3216.39301057087050 hartree
exchangeener: -253.637320649728 hartree
correlationener: -8.086973121246 hartree
xcener: -261.724293770974 hartree
s2: 0.751643
energy: -8766.5048 -1046.8486 -916.9023 -916.6044 -916.6029 -665.0931 -665.0910 -665.0666 -665.0662 -665.0657 -665.0646 -513.9771 -513.9750 -513.2815 -513.2805 -384.2725 -384.2596 -384.2575 -384.2412 -278.2831 -278.2828 -275.0089 -275.0085 -273.4569 -273.4529 -273.4509 -273.4444 -272.8826 -272.8772 -272.8766 -272.8697 -115.3807 -75.7292 -74.3587 -74.3523 -33.3852 -33.3846 -31.1859 -31.1846 -31.1428 -31.1421 -27.1985 -27.1864 -25.1196 -25.1053 -23.7163 -23.6422 -23.6408 -23.5912 -19.6240 -19.6065 -19.6061 -19.5970 -18.2464 -18.2359 -15.4999 -15.4503 -14.5618 -14.5616 -14.5292 -14.5238 -13.4998 -12.9682 -12.9668 -12.9042 -12.6924 -12.5726 -11.8237 -11.4472 -11.4250 -11.4243 -11.4148 -11.4134 -11.3983 -11.3850 -11.3603 -11.2860 -11.2841 -11.2498 -11.2292 -11.1695 -11.0800 -10.9515 -10.9012 -10.8740 -10.6329 -10.6241 -10.2876 -10.2804 -10.2028 -10.2005 -9.9107 -9.9088 -9.6838 -9.6837 -9.3145 -8.9256 -8.8909 -8.7599 -8.5959 -8.5926 -8.5873 -8.3669 -8.3465 -7.6105 -7.5795 -7.2035 -7.0340 -6.9188 -6.8831 -6.4072 -6.2961 -6.0161 -5.3787 -0.9441 -0.9329 -0.7856 -0.7518 -0.4793 -0.4759 -0.3509 -0.3386 -0.2594 0.0555 0.0614 electronvolt
energy: -8766.4992 -1046.4466 -916.3828 -916.3826 -916.3644 -665.0886 -665.0866 -665.0660 -665.0655 -665.0651 -665.0639 -513.8738 -513.8724 -513.2775 -513.2764 -384.2562 -384.2454 -384.2432 -384.2295 -278.2681 -278.2679 -275.0123 -275.0119 -273.4571 -273.4532 -273.4512 -273.4451 -272.8822 -272.8767 -272.8762 -272.8691 -114.4694 -74.1908 -73.7867 -73.7846 -33.3801 -33.3795 -31.1801 -31.1788 -31.1414 -31.1406 -27.1134 -27.1025 -25.0263 -25.0114 -23.7027 -23.6298 -23.6287 -23.5791 -19.6221 -19.6048 -19.6043 -19.5949 -18.2059 -18.1968 -15.4545 -15.4110 -14.5556 -14.5554 -14.5180 -14.5136 -13.4558 -12.9585 -12.9532 -12.8915 -12.5981 -12.5076 -11.7155 -11.4458 -11.4232 -11.4225 -11.4135 -11.4128 -11.3981 -11.3856 -11.3616 -11.2816 -11.2801 -11.2202 -11.2198 -11.0266 -11.0177 -10.8730 -10.8646 -10.7615 -10.5920 -10.5859 -10.2517 -10.2503 -10.1904 -10.1889 -9.8977 -9.8945 -9.6817 -9.6816 -9.2525 -8.8609 -8.8232 -8.7406 -8.5846 -8.5797 -8.5750 -8.3378 -7.6502 -7.4614 -7.3968 -6.9488 -6.8095 -6.7555 -6.5192 -6.3102 -6.2667 -4.9055 -4.6104 -0.9285 -0.9170 -0.7581 -0.7285 -0.4720 -0.4688 -0.3377 -0.3246 -0.2502 0.0591 electronvolt
chargesum: -0.0000000
charge: -0.443305 -0.442413 0.275319 -0.408262 -0.407648 0.276070 0.411962 0.411895 -0.165516 -0.157773 -0.165067 -0.165331 -0.157784 -0.165288 0.175971 -0.109744 0.090964 -0.114055 0.097241 -0.114881 0.102592 -0.114471 0.097701 -0.037970 0.112039 0.112160 0.111931 -0.041030 0.111644 0.112667 0.112198 -0.037889 0.112098 0.112147 0.111869 -0.037058 0.112326 0.112239 0.112451
charge: 0.027453 0.028005 -0.572594 0.150321 0.150577 -0.572769 -0.614313 -0.614348 0.167789 0.183125 0.168358 0.167990 0.183284 0.168099 -0.452298 -0.054760 0.214086 -0.055872 0.209255 -0.056771 0.203710 -0.055763 0.209186 0.046720 0.052644 0.052488 0.052682 0.046724 0.052533 0.052715 0.052825 0.046693 0.052625 0.052520 0.052649 0.046632 0.052628 0.052623 0.052549
qa: -0.4433 -0.4424 0.2753 -0.4083 -0.4076 0.2761 0.4120 0.4119 -0.1655 -0.1578 -0.1651 -0.1653 -0.1578 -0.1653 0.1760 -0.1097 0.0910 -0.1141 0.0972 -0.1149 0.1026 -0.1145 0.0977 -0.0380 0.1120 0.1122 0.1119 -0.0410 0.1116 0.1127 0.1122 -0.0379 0.1121 0.1121 0.1119 -0.0371 0.1123 0.1122 0.1125
va: 2.0420 2.0441 4.2606 2.0349 2.0347 4.2592 4.5077 4.5081 1.1301 1.1549 1.1306 1.1302 1.1550 1.1304 2.9529 3.7379 3.0520 3.7403 3.0168 3.7380 2.9831 3.7411 3.0170 3.9065 1.0039 1.0037 1.0047 3.9054 1.0052 1.0037 1.0040 3.9061 1.0040 1.0037 1.0047 3.9069 1.0039 1.0040 1.0037
dispersion: -0.051968792 hartree
s2: 0.751601
dispersion: -0.051773022 hartree
s2: 0.751392
dispersion: -0.051086430 hartree
s2: 0.751288
dispersion: -0.050839944 hartree
s2: 0.751218
dispersion: -0.050701727 hartree
s2: 0.751179
dispersion: -0.050626502 hartree
s2: 0.751197
dispersion: -0.050670752 hartree
s2: 0.751210
dispersion: -0.050721833 hartree
s2: 0.751206
dispersion: -0.050743525 hartree
s2: 0.751200
dispersion: -0.050741168 hartree
dispersion: -0.050753133 hartree
dispersion: -0.050791092 hartree
s2: 0.751201
dispersion: -0.050799937 hartree
dispersion: -0.050808195 hartree
s2: 0.751214
dispersion: -0.050818881 hartree
dispersion: -0.050812174 hartree
s2: 0.751217
dispersion: -0.050794560 hartree
s2: 0.751215
dispersion: -0.050775654 hartree
dispersion: -0.050769978 hartree
s2: 0.751216
dispersion: -0.050770686 hartree
dispersion: -0.050782007 hartree
s2: 0.751221
dispersion: -0.050809059 hartree
s2: 0.751227
dispersion: -0.050859356 hartree
s2: 0.751237
dispersion: -0.050958594 hartree
s2: 0.751259
dispersion: -0.051153424 hartree
s2: 0.751289
dispersion: -0.051326053 hartree
s2: 0.751343
dispersion: -0.051543034 hartree
s2: 0.751393
dispersion: -0.051620754 hartree
s2: 0.751404
dispersion: -0.051302939 hartree
s2: 0.751424
dispersion: -0.050994030 hartree
s2: 0.751453
dispersion: -0.050817126 hartree
s2: 0.751472
dispersion: -0.050651501 hartree
s2: 0.751476
dispersion: -0.050498707 hartree
s2: 0.751522
dispersion: -0.050472207 hartree
s2: 0.751528
dispersion: -0.050301046 hartree
s2: 0.751562
dispersion: -0.050131853 hartree
s2: 0.751603
dispersion: -0.049977134 hartree
s2: 0.751679
dispersion: -0.049633279 hartree
s2: 0.751701
dispersion: -0.049400274 hartree
s2: 0.751743
dispersion: -0.049019450 hartree
s2: 0.751764
dispersion: -0.048602419 hartree
s2: 0.751785
dispersion: -0.048239689 hartree
s2: 0.751759
dispersion: -0.048327357 hartree
dispersion: -0.048344531 hartree
s2: 0.751752
dispersion: -0.048201057 hartree
dispersion: -0.047999105 hartree
s2: 0.751754
dispersion: -0.047956833 hartree
s2: 0.751757
dispersion: -0.047901366 hartree
s2: 0.751758
dispersion: -0.047803335 hartree
dispersion: -0.047807011 hartree
s2: 0.751760
dispersion: -0.048148043 hartree
dispersion: -0.048397771 hartree
s2: 0.751839
dispersion: -0.048901182 hartree
s2: 0.751703
dispersion: -0.047106623 hartree
s2: 0.751717
dispersion: -0.047633429 hartree
s2: 0.751776
dispersion: -0.048239504 hartree
s2: 0.751777
dispersion: -0.048403856 hartree
s2: 0.751747
dispersion: -0.047874317 hartree
s2: 0.751775
dispersion: -0.048054383 hartree
s2: 0.751774
dispersion: -0.048205250 hartree
s2: 0.751779
dispersion: -0.048243168 hartree
s2: 0.751780
dispersion: -0.048382241 hartree
s2: 0.751772
dispersion: -0.048196948 hartree
s2: 0.751755
dispersion: -0.047962686 hartree
s2: 0.751768
dispersion: -0.048096052 hartree
dispersion: -0.048080039 hartree
s2: 0.751763
dispersion: -0.048124826 hartree
dispersion: -0.048102721 hartree
s2: 0.751765
dispersion: -0.048077736 hartree
dispersion: -0.048091962 hartree
dispersion: -0.048104895 hartree
dispersion: -0.048142785 hartree
s2: 0.751766
dispersion: -0.048179566 hartree
s2: 0.751767
dispersion: -0.048236837 hartree
dispersion: -0.048290281 hartree
dispersion: -0.048360838 hartree
dispersion: -0.048383662 hartree
dispersion: -0.048430910 hartree
dispersion: -0.048500388 hartree
dispersion: -0.048610936 hartree
dispersion: -0.048799599 hartree
dispersion: -0.048827105 hartree
dispersion: -0.048866382 hartree
dispersion: -0.048896939 hartree
dispersion: -0.048950331 hartree
dispersion: -0.049020091 hartree
dispersion: -0.049051082 hartree
dispersion: -0.049072462 hartree
dispersion: -0.049005484 hartree
dispersion: -0.049033714 hartree
dispersion: -0.049065773 hartree
dispersion: -0.049011564 hartree
dispersion: -0.049113945 hartree
s2: 0.751762
dispersion: -0.049062815 hartree
s2: 0.751756
dispersion: -0.048949709 hartree
dispersion: -0.049090922 hartree
dispersion: -0.049116038 hartree
dispersion: -0.048974959 hartree
s2: 0.751761
dispersion: -0.048981112 hartree
s2: 0.751753
dispersion: -0.049099000 hartree
dispersion: -0.049044492 hartree
dispersion: -0.048938156 hartree
dispersion: -0.049028847 hartree
dispersion: -0.049085806 hartree
dispersion: -0.049044962 hartree
s2: 0.751745
dispersion: -0.048981049 hartree
dispersion: -0.049073946 hartree
dispersion: -0.049055385 hartree
dispersion: -0.049043989 hartree
dispersion: -0.049028747 hartree
dispersion: -0.049072246 hartree
dispersion: -0.049055398 hartree
dispersion: -0.049089076 hartree
dispersion: -0.049060728 hartree
dispersion: -0.049045726 hartree
dispersion: -0.049097543 hartree
elementType: O C F Cu N H
dispersion: -0.049064652 hartree
energy: -3225.033208852563 hartree
