program: Orca
programVersion: 6.0.0
elementType: O O C O O C C C F F F F F F O H H Cu O H H O H H O H H
charge: 0
multiplicity: 2
keywords: b3lyp d3bj def2-TZVPP def2/J RIJCOSX TightSCF defgrid3 CPCM(Acetonitrile)
formula: C4H8CuF6O8
InChI: InChI=1/2C2F3O2.Cu.4H2O/c2*3-2(4,5)1(6)7;;;;;/h;;;4*1H2/q2*-1;+2;;;;/rC4H4CuF6O6.2H2O/c6-3(7,8)1(12)16-5(14,15)17-2(13)4(9,10)11;;/h14-15H2;2*1H2
27 atoms
O  0.914106 1.031137 8.262321
O  3.769615 6.7253 6.600475
C  2.679766 6.454645 6.067715
O  2.911836 2.121119 8.16301
O  2.011047 5.373786 6.079983
C  2.123515 1.182676 8.50147
C  2.848939 0.081561 9.33678
C  1.968379 7.575228 5.24669
F  3.848871 -0.48977 8.616078
F  2.014077 -0.904096 9.724356
F  3.407484 0.608298 10.456517
F  0.759674 7.875731 5.789511
F  2.686729 8.715867 5.200613
F  1.749535 7.177973 3.967025
O  0.526814 3.169054 6.800937
H  0.491166 2.935663 5.856989
H  0.491989 2.29504 7.301543
Cu 2.437352 3.749151 7.142244
O  2.862825 2.627345 5.040248
H  3.447501 1.869343 5.199643
H  3.381081 3.220362 4.473319
O  1.635686 4.829548 9.144136
H  2.32978 5.401152 9.509984
H  0.951834 5.449677 8.844003
O  4.344826 4.3278 7.448279
H  4.574203 4.234924 8.387988
H  4.301463 5.314622 7.247679
elementType: O C F H Cu
totalener: -2998.77805605177264 hartree
nucrepener: 2267.69266297969534 hartree
electener: -5266.42846224637560 hartree
oneelecener: -8685.26653086763326 hartree
twoeener: 3418.83806862125766 hartree
cpcmener: -0.04225979545916 hartree
kineticenergy: 2991.18704427246121 hartree
exchangeener: -171.744320692781 hartree
correlationener: -8.068914902867 hartree
xcener: -179.813235595649 hartree
s2: 0.751641
energy: -8792.3235 -1059.2007 -928.7690 -928.7376 -928.4061 -672.7854 -672.7853 -672.7743 -672.7742 -672.7737 -672.7727 -521.4231 -521.3351 -520.9897 -520.9751 -520.9669 -520.9549 -520.6519 -520.6466 -283.9276 -283.9253 -280.9216 -280.9127 -120.3817 -79.9425 -79.8117 -78.3195 -35.9146 -35.9130 -33.6209 -33.6195 -33.5773 -33.5764 -29.8509 -29.8147 -28.2941 -28.2432 -27.9048 -27.8868 -27.5714 -27.5148 -20.2910 -20.2804 -17.5139 -17.4879 -16.4290 -16.4284 -16.4206 -16.4031 -15.4630 -15.2232 -14.8529 -14.7506 -14.6951 -14.4404 -13.6176 -13.3092 -13.2895 -13.1881 -13.1859 -13.0979 -13.0516 -12.5989 -12.5810 -12.2330 -12.1684 -12.1050 -12.1025 -11.9923 -11.8530 -11.7758 -11.6958 -11.5643 -11.5608 -11.4428 -11.0731 -10.8727 -10.4687 -10.3583 -10.1624 -9.9169 -9.7791 -9.3472 -8.9423 -8.7193 -8.5648 -8.3940 -8.3017 -8.2675 -7.8651 -0.7155 -0.6546 -0.1418 0.8114 1.4488 1.9797 2.3087 2.6247 2.8640 3.0576 3.3071 electronvolt
energy: -8792.3124 -1058.5829 -928.2417 -928.0775 -928.0719 -672.7836 -672.7836 -672.7744 -672.7743 -672.7737 -672.7726 -521.3655 -521.2767 -520.9763 -520.9562 -520.9274 -520.9061 -520.6530 -520.6477 -283.9226 -283.9205 -280.9233 -280.9142 -119.1175 -78.0879 -78.0711 -77.9251 -35.9126 -35.9111 -33.6183 -33.6170 -33.5772 -33.5763 -29.7997 -29.7658 -28.1779 -28.1285 -27.9019 -27.8853 -27.5080 -27.4487 -20.2663 -20.2596 -17.4729 -17.4637 -16.4273 -16.4264 -16.4105 -16.3971 -15.3888 -15.1855 -14.7669 -14.7214 -14.6639 -14.3863 -13.5378 -13.2612 -13.1857 -13.1831 -13.0927 -13.0269 -12.5846 -12.5690 -12.3287 -12.1677 -12.1272 -12.0944 -11.9362 -11.8902 -11.8210 -11.6838 -11.6393 -11.5617 -11.5583 -11.3378 -10.7764 -10.3452 -10.0630 -9.9099 -9.7458 -9.4082 -9.3241 -9.2390 -8.7119 -8.6808 -8.4280 -8.3459 -8.2661 -7.8499 -3.3970 -0.7085 -0.6413 -0.1206 0.8155 1.4617 1.9904 2.3175 2.6357 2.8848 3.0646 electronvolt
chargesum: 0.0000000
charge: -0.436738 -0.439567 0.291587 -0.420445 -0.412293 0.293312 0.516557 0.518339 -0.185122 -0.177853 -0.184255 -0.185310 -0.178307 -0.184552 -0.357685 0.248244 0.251283 0.718069 -0.424100 0.253328 0.255995 -0.411444 0.246915 0.254475 -0.358295 0.256779 0.251084
charge: 0.093084 0.091081 -0.512108 0.128401 0.128625 -0.509651 -0.596275 -0.596186 0.172385 0.187115 0.173600 0.172256 0.186652 0.173539 0.398224 -0.066609 -0.141965 -0.087573 0.357951 -0.077874 -0.077822 0.357217 -0.078765 -0.077575 0.406161 -0.062353 -0.141533
qa: -0.4367 -0.4396 0.2916 -0.4204 -0.4123 0.2933 0.5166 0.5183 -0.1851 -0.1779 -0.1843 -0.1853 -0.1783 -0.1846 -0.3577 0.2482 0.2513 0.7181 -0.4241 0.2533 0.2560 -0.4114 0.2469 0.2545 -0.3583 0.2568 0.2511
va: 2.0546 2.0496 4.2356 2.0405 2.0363 4.2348 4.4444 4.4427 1.1078 1.1287 1.1101 1.1080 1.1281 1.1096 2.1536 1.0081 1.0679 2.5170 2.0285 0.9948 0.9930 2.0428 1.0013 0.9944 2.1641 0.9978 1.0666
dispersion: -0.044161156 hartree
energy: -2998.822217208018 hartree
dipole: 0.472236990 0.523620731 0.995857720 0.379339308 0.053490580 0.432829888 -0.864620940 0.483332317 -0.381288623
dipolemethod: SCF
magnitude: 1.150849827 au
magnitude: 2.925227789 debye
