program: Orca
programVersion: 6.0.0
elementType: O O C O O C C C F F F F F F Cu
charge: 0
multiplicity: 2
keywords: b3lyp d3bj def2-TZVPP def2/J RIJCOSX TightSCF defgrid3 CPCM(Acetonitrile)
formula: C4CuF6O4
InChI: InChI=1/2C2F3O2.Cu/c2*3-2(4,5)1(6)7;/q2*-2;+4/rC4CuF6O4/c6-3(7,8)1-12-5(13-1)14-2(15-5)4(9,10)11
15 atoms
O  1.594276 1.969279 7.613958
O  2.770858 5.800336 7.072471
C  2.101415 5.775728 5.997352
O  2.888788 3.040506 9.034005
O  1.475962 4.731773 5.650927
C  2.263585 1.995835 8.689098
C  2.30368 0.733898 9.577138
C  2.057071 7.040899 5.114103
F  2.803129 -0.311607 8.881631
F  1.055352 0.409367 9.981529
F  3.066622 0.920246 10.667899
F  1.501575 8.066661 5.797308
F  3.308225 7.405472 4.7567
F  1.338919 6.839052 3.996001
Cu 2.181905 3.885357 7.34248
elementType: O C F Cu
totalener: -2692.96557456913570 hartree
nucrepener: 1450.11691284620565 hartree
electener: -4143.05804121522306 hartree
oneelecener: -6627.64295439439775 hartree
twoeener: 2484.58491317917469 hartree
cpcmener: -0.02444250989725 hartree
kineticenergy: 2686.58213578489540 hartree
exchangeener: -143.256881419247 hartree
correlationener: -6.426260892166 hartree
xcener: -149.683142311413 hartree
s2: 0.752258
energy: -8793.1111 -1059.9310 -929.4877 -929.4723 -929.1644 -673.1453 -673.1448 -673.1356 -673.1354 -673.1352 -673.1352 -521.7837 -521.7835 -521.7450 -521.7435 -284.4942 -284.4935 -281.6324 -281.6317 -121.0610 -80.5425 -80.4510 -79.1258 -36.3334 -36.3332 -34.0242 -34.0238 -33.9808 -33.9806 -30.9652 -30.8836 -28.1302 -28.1092 -20.9524 -20.9115 -18.0153 -17.9513 -16.8354 -16.8347 -16.8230 -16.8153 -15.1610 -14.9306 -14.5249 -13.9483 -13.6429 -13.5712 -13.4789 -13.3841 -13.3151 -13.2471 -13.1258 -12.8394 -12.4459 -12.4394 -12.3523 -12.2626 -12.1162 -11.8911 -11.8903 -11.2357 -11.1816 -11.0938 -10.7207 -9.9402 -9.8030 -9.5425 -9.3929 -9.2127 -8.3742 -1.6363 -1.4027 -0.3263 1.8646 2.1374 2.2606 2.4164 2.7710 3.2306 3.5826 4.0531 electronvolt
energy: -8793.1015 -1059.3601 -929.0103 -928.8601 -928.8475 -673.1434 -673.1429 -673.1351 -673.1349 -673.1347 -673.1346 -521.7078 -521.7077 -521.6696 -521.6682 -284.4951 -284.4945 -281.6382 -281.6376 -119.8986 -78.8907 -78.7990 -78.7572 -36.3316 -36.3314 -34.0211 -34.0207 -33.9798 -33.9795 -30.8319 -30.7480 -27.9550 -27.9397 -20.9310 -20.8905 -17.9908 -17.9279 -16.8353 -16.8347 -16.8103 -16.8090 -15.0826 -14.8570 -13.8639 -13.8513 -13.6097 -13.5610 -13.3922 -13.3706 -13.2057 -13.1853 -13.1061 -12.7213 -12.4306 -12.4264 -12.3229 -12.2519 -11.8890 -11.8884 -10.8544 -10.7647 -10.7428 -10.2119 -10.0760 -9.5732 -9.4921 -9.3084 -9.0799 -9.0476 -4.3438 -1.6261 -1.3792 -0.2493 1.8495 2.1572 2.3293 2.4258 2.8191 3.2402 3.5924 electronvolt
chargesum: -0.0000000
charge: -0.405537 -0.405409 0.434504 -0.394061 -0.394059 0.434387 0.512045 0.511958 -0.166799 -0.167036 -0.162679 -0.167085 -0.166700 -0.162657 0.699129
charge: 0.142417 0.142558 -0.469269 0.147107 0.147122 -0.469276 -0.603110 -0.603027 0.196043 0.195607 0.206421 0.195469 0.196144 0.206408 0.369384
qa: -0.4055 -0.4054 0.4345 -0.3941 -0.3941 0.4344 0.5120 0.5120 -0.1668 -0.1670 -0.1627 -0.1671 -0.1667 -0.1627 0.6991
va: 2.1165 2.1167 3.8505 2.1173 2.1173 3.8508 4.4948 4.4949 1.1399 1.1393 1.1509 1.1392 1.1400 1.1509 2.3247
dispersion: -0.021928247 hartree
energy: -2692.987502816230 hartree
dipole: 0.004508446 -0.000709537 0.003798909 -0.001371909 -0.000248082 -0.001619991 -0.001581750 -0.002502512 -0.004084262
dipolemethod: SCF
magnitude: 0.005808380 au
magnitude: 0.014763728 debye
