program: Orca
programVersion: 6.0.0
elementType: O O C O O C C C F F F F F F O H H Ni C N C H H H
charge: 0
multiplicity: 3
keywords: b3lyp d3bj def2-TZVPP def2/J RIJCOSX TightSCF defgrid3 CPCM(Acetonitrile)
formula: C6H5F6NNiO5
InChI: InChI=1/2C2F3O2.C2H3N.Ni.H2O/c2*3-2(4,5)1(6)7;1-2-3;;/h;;1H3;;1H2/q2*-1;;+2;/rC6H5F6NNiO5/c1-2-13-14(17,18-3(15)5(7,8)9)19-4(16)6(10,11)12/h17H2,1H3
24 atoms
O  0.936249 1.109985 8.433688
O  1.566046 2.984435 4.652184
C  2.758932 2.653151 4.708202
O  3.127037 1.721841 8.443445
O  3.566399 2.675423 5.696056
C  2.132384 0.964709 8.715623
C  2.561778 -0.304156 9.512706
C  3.441639 2.118306 3.41072
F  3.421717 -1.061229 8.783982
F  1.509682 -1.080984 9.838267
F  3.1948 0.034456 10.664274
F  3.923299 0.863283 3.59721
F  2.589946 2.07717 2.366896
F  4.488332 2.90655 3.055037
O  1.052018 3.477953 7.218122
H  1.015057 3.347123 6.224609
H  0.779966 2.600752 7.617239
Ni 3.035918 3.3717 7.454925
C  3.728912 6.326826 6.907081
N  3.469559 5.222479 7.123783
C  4.056109 7.708991 6.634914
H  3.192897 8.337764 6.869815
H  4.907626 8.007359 7.252704
H  4.313361 7.816829 5.577483
elementType: O C F H Ni N
totalener: -2770.02703933192515 hartree
nucrepener: 2031.58983266108430 hartree
electener: -4801.57921047346190 hartree
oneelecener: -7886.53392721148793 hartree
twoeener: 3084.95471673802604 hartree
cpcmener: -0.03765977411687 hartree
kineticenergy: 2762.91171790657972 hartree
exchangeener: -161.609845089920 hartree
correlationener: -7.630204233814 hartree
xcener: -169.240049323734 hartree
s2: 2.004466
energy: -8161.5364 -976.1873 -851.6367 -851.5439 -851.5140 -672.8143 -672.8041 -672.8012 -672.7925 -672.7830 -672.7820 -521.2308 -521.1567 -521.0789 -520.7360 -520.6568 -390.9930 -283.9775 -283.9445 -281.0351 -280.9413 -279.5641 -278.1035 -112.8189 -74.5734 -74.3995 -74.3598 -35.9511 -35.9305 -33.6565 -33.6351 -33.6105 -33.5913 -29.9457 -29.8453 -28.1305 -27.6490 -27.5826 -26.2106 -21.4677 -20.3525 -20.3039 -17.5675 -17.5139 -16.4639 -16.4504 -16.4429 -16.4253 -15.2849 -15.1343 -14.7856 -14.7462 -13.7476 -13.5398 -13.2484 -13.2423 -13.1861 -13.1045 -13.1006 -12.8674 -12.8487 -12.7630 -12.6938 -12.5320 -12.3021 -12.1774 -12.1305 -12.1018 -11.9407 -11.7761 -11.5882 -11.5704 -11.4235 -11.0207 -10.8391 -10.6041 -10.2424 -10.0831 -9.8909 -9.7063 -8.8355 -8.6489 -8.4863 -8.3545 -8.3430 -8.0821 -0.8322 -0.7170 -0.5006 -0.3395 0.2446 1.1618 1.8740 2.5368 2.6821 3.1043 3.1685 electronvolt
energy: -8161.5101 -974.9804 -850.5933 -850.5798 -850.5375 -672.8135 -672.8042 -672.8009 -672.7905 -672.7830 -672.7820 -521.1543 -521.1099 -520.9985 -520.7341 -520.6573 -390.9705 -283.9753 -283.9378 -281.0372 -280.9447 -279.5585 -278.1029 -110.2207 -71.7325 -71.7173 -71.6427 -35.9500 -35.9280 -33.6552 -33.6321 -33.6103 -33.5911 -29.8983 -29.7809 -27.9754 -27.5871 -27.4948 -26.1732 -21.4624 -20.3380 -20.2747 -17.5400 -17.4728 -16.4628 -16.4439 -16.4406 -16.4157 -15.1455 -14.9872 -14.6894 -14.5571 -13.6672 -13.2474 -13.2288 -13.1792 -13.1528 -13.0794 -13.0091 -12.8461 -12.8336 -12.6744 -12.5295 -12.3455 -12.1510 -12.1254 -12.0850 -11.9113 -11.7622 -11.7050 -11.5865 -11.5681 -10.5940 -10.4888 -10.2962 -9.6042 -9.4009 -9.2211 -9.0614 -9.0222 -8.6881 -8.3064 -8.2399 -8.1539 -3.1758 -2.8838 -0.7509 -0.6834 -0.3089 -0.2505 0.4016 1.2422 1.9537 2.5798 2.7268 electronvolt
chargesum: -0.0000000
charge: -0.428138 -0.439554 0.300910 -0.450223 -0.475890 0.304588 0.510201 0.500074 -0.182636 -0.176117 -0.182220 -0.182675 -0.177176 -0.183810 -0.447598 0.255187 0.258236 0.774605 0.067561 0.013886 -0.114799 0.151756 0.152027 0.151806
charge: 0.090569 0.084547 -0.515574 0.120782 0.125528 -0.506339 -0.599730 -0.600178 0.174883 0.189671 0.175756 0.174867 0.188508 0.173748 0.374402 -0.136931 -0.139198 0.175368 0.004933 0.204130 0.054863 0.061688 0.061889 0.061819
qa: -0.4281 -0.4396 0.3009 -0.4502 -0.4759 0.3046 0.5102 0.5001 -0.1826 -0.1761 -0.1822 -0.1827 -0.1772 -0.1838 -0.4476 0.2552 0.2582 0.7746 0.0676 0.0139 -0.1148 0.1518 0.1520 0.1518
va: 2.0633 2.0504 4.2567 2.0308 1.9925 4.2294 4.4515 4.4600 1.1119 1.1313 1.1134 1.1122 1.1291 1.1112 2.1091 1.0651 1.0572 3.4977 3.6287 3.2578 3.8306 0.9872 0.9874 0.9871
dispersion: -0.039562000 hartree
energy: -2770.066601331635 hartree
dipole: -2.313461290 4.002472173 1.689010883 24.191888861 -18.450806053 5.741082808 0.168704856 0.595748054 0.764452910
dipolemethod: SCF
magnitude: 6.033007361 au
magnitude: 15.334686044 debye
