program: Orca
programVersion: 6.0.0
elementType: O O C O O C C C F F F F F F O H H Ni C N C H H H
charge: 0
multiplicity: 3
keywords: TPSS D3BJ TightOpt Freq def2-TZVPP def2/J RIJCOSX TightSCF defgrid3 CPCM(Acetonitrile)
frequency: 0.00 0.00 0.00 0.00 0.00 0.00 9.34 17.08 19.50 22.13 35.49 43.90 50.43 73.71 78.30 114.94 116.80 129.22 154.52 174.83 187.60 205.03 211.13 224.64 262.00 267.72 297.71 312.83 330.89 402.79 405.41 409.08 416.46 422.95 486.20 493.94 494.83 498.11 591.28 599.76 640.28 693.04 694.92 763.33 764.20 802.31 805.10 949.72 954.16 986.41 1036.73 1037.72 1057.16 1057.76 1102.90 1104.58 1146.11 1152.21 1367.25 1376.80 1380.96 1431.37 1432.31 1604.96 1623.25 1642.87 2322.40 3019.11 3097.82 3098.76 3111.73 3130.47
frequency: 9.34 17.08 19.50 22.13 35.49 43.90 50.43 73.71 78.30 114.94 116.80 129.22 154.52 174.83 187.60 205.03 211.13 224.64 262.00 267.72 297.71 312.83 330.89 402.79 405.41 409.08 416.46 422.95 486.20 493.94 494.83 498.11 591.28 599.76 640.28 693.04 694.92 763.33 764.20 802.31 805.10 949.72 954.16 986.41 1036.73 1037.72 1057.16 1057.76 1102.90 1104.58 1146.11 1152.21 1367.25 1376.80 1380.96 1431.37 1432.31 1604.96 1623.25 1642.87 2322.40 3019.11 3097.82 3098.76 3111.73 3130.47
formula: C6H5F6NNiO5
InChI: InChI=1/2C2F3O2.C2H3N.Ni.H2O/c2*3-2(4,5)1(6)7;1-2-3;;/h;;1H3;;1H2/q2*-1;;+2;/rC6H5F6NNiO5/c1-2-13-14(17,18-3(15)5(7,8)9)19-4(16)6(10,11)12/h17H2,1H3
24 atoms
O  0.936249 1.109985 8.433688
O  1.566046 2.984435 4.652184
C  2.758932 2.653151 4.708202
O  3.127037 1.721841 8.443445
O  3.566399 2.675423 5.696056
C  2.132384 0.964709 8.715623
C  2.561778 -0.304156 9.512706
C  3.441639 2.118306 3.41072
F  3.421717 -1.061229 8.783982
F  1.509682 -1.080984 9.838267
F  3.1948 0.034456 10.664274
F  3.923299 0.863283 3.59721
F  2.589946 2.07717 2.366896
F  4.488332 2.90655 3.055037
O  1.052018 3.477953 7.218122
H  1.015057 3.347123 6.224609
H  0.779966 2.600752 7.617239
Ni 3.035918 3.3717 7.454925
C  3.728912 6.326826 6.907081
N  3.469559 5.222479 7.123783
C  4.056109 7.708991 6.634914
H  3.192897 8.337764 6.869815
H  4.907626 8.007359 7.252704
H  4.313361 7.816829 5.577483
totalener: -2770.79583715733042 hartree
nucrepener: 2031.67836888505030 hartree
electener: -4802.44103916493259 hartree
oneelecener: -7887.00684742942940 hartree
twoeener: 3084.56580826449635 hartree
cpcmener: -0.03316687744824 hartree
kineticenergy: 2763.67995995034198 hartree
exchangeener: -204.304282540207 hartree
correlationener: -6.210854429648 hartree
xcener: -210.515136969855 hartree
s2: 2.003367
dispersion: -0.029259241 hartree
dispersion: -0.029258075 hartree
s2: 2.003368
dispersion: -0.029258519 hartree
s2: 2.003369
dispersion: -0.029259852 hartree
dispersion: -0.029258604 hartree
dispersion: -0.029258949 hartree
dispersion: -0.029259056 hartree
dispersion: -0.029259722 hartree
elementType: O C F H Ni N
energy: -8136.9364 -964.6314 -840.4964 -840.4202 -840.3914 -665.3247 -665.3211 -665.3048 -665.3036 -665.2986 -665.2985 -514.7873 -514.6799 -514.6601 -514.1319 -514.0760 -385.0924 -278.6230 -278.6218 -275.7037 -275.6369 -274.2212 -273.1285 -108.2615 -70.4635 -70.3166 -70.2752 -33.6873 -33.6825 -31.4747 -31.4690 -31.4253 -31.4201 -28.0229 -27.9420 -26.4168 -25.8089 -25.7716 -24.3618 -19.9632 -18.6807 -18.6542 -15.9523 -15.9177 -14.8479 -14.8420 -14.8338 -14.8246 -13.8922 -13.7457 -13.3758 -13.2501 -12.3515 -12.0275 -11.8314 -11.7358 -11.7192 -11.6436 -11.5458 -11.4266 -11.4236 -11.2708 -11.1450 -11.0458 -10.7304 -10.6500 -10.4654 -10.4574 -10.3108 -10.2464 -9.9072 -9.9028 -9.7411 -9.4869 -9.3226 -9.0080 -8.5737 -8.3780 -7.9147 -7.7073 -7.6420 -7.1090 -7.0715 -7.0005 -6.9111 -6.5525 -1.5875 -1.4968 -1.1658 -1.0562 -0.1717 0.8721 1.4653 2.1763 2.2457 2.4915 2.5939 electronvolt
energy: -8136.9202 -963.7682 -839.7553 -839.7335 -839.7059 -665.3232 -665.3177 -665.3050 -665.3030 -665.2984 -665.2982 -514.6959 -514.6218 -514.5619 -514.1284 -514.0744 -385.0721 -278.6197 -278.6116 -275.7059 -275.6412 -274.2149 -273.1277 -106.2139 -68.3552 -68.3283 -68.2688 -33.6858 -33.6788 -31.4728 -31.4647 -31.4249 -31.4194 -27.9675 -27.8717 -26.2575 -25.7465 -25.6809 -24.3305 -19.9582 -18.6648 -18.6206 -15.9302 -15.8831 -14.8461 -14.8380 -14.8274 -14.8142 -13.8260 -13.6386 -13.3312 -13.1331 -12.2777 -11.8622 -11.7400 -11.7173 -11.7094 -11.6160 -11.5373 -11.4192 -11.4093 -11.2450 -11.1256 -10.8615 -10.6078 -10.4844 -10.4553 -10.4384 -10.2833 -10.2387 -9.9062 -9.9010 -9.3969 -9.3591 -9.0750 -8.2194 -8.0765 -8.0419 -7.7200 -7.3423 -7.2470 -6.7766 -6.6635 -6.4512 -4.5557 -4.1806 -1.5368 -1.4727 -1.0416 -0.9854 0.0531 0.9566 1.5622 2.2420 2.2888 electronvolt
chargesum: -0.0000000
charge: -0.399877 -0.410764 0.298029 -0.411794 -0.428853 0.292317 0.413527 0.402430 -0.153518 -0.147201 -0.153291 -0.152904 -0.147326 -0.154016 -0.423379 0.255432 0.258075 0.650267 -0.064412 0.127380 -0.011107 0.120227 0.120485 0.120272
charge: 0.107160 0.102487 -0.531056 0.145058 0.155501 -0.523753 -0.628479 -0.628140 0.185277 0.200101 0.186009 0.185730 0.199762 0.184629 0.396522 -0.138180 -0.140731 0.110546 -0.010010 0.205302 0.059885 0.058704 0.058838 0.058838
qa: -0.3999 -0.4108 0.2980 -0.4118 -0.4289 0.2923 0.4135 0.4024 -0.1535 -0.1472 -0.1533 -0.1529 -0.1473 -0.1540 -0.4234 0.2554 0.2581 0.6503 -0.0644 0.1274 -0.0111 0.1202 0.1205 0.1203
va: 2.1067 2.0958 4.2447 2.0977 2.0648 4.2315 4.5390 4.5508 1.1514 1.1721 1.1527 1.1526 1.1715 1.1517 2.1374 1.0656 1.0592 3.5519 3.7207 3.2041 3.9092 1.0035 1.0037 1.0033
dispersion: -0.029259841 hartree
energy: -2770.825097175789 hartree
dipole: -2.313461831 3.871959388 1.558497556 24.191887606 -18.711217916 5.480669690 0.168704708 0.485086584 0.653791292
dipolemethod: SCF
magnitude: 5.735337648 au
magnitude: 14.578069763 debye
temp: 298.15 k
press: 1.00 atm
zeropoint: 0.12518363 hartree
thermalvibcorrection: 0.01922825 hartree
thermalrotcorrection: 0.00141627 hartree
thermaltrasncorrection: 0.00141627 hartree
thermaltotal: -2770.67785275 hartree
thermalcorr: 0.02206079 hartree
nonthermalcorr: 0.12518363 hartree
totalcorr: 0.14724442 hartree
thermalcorrenthalpy: 0.00094421 hartree
totalenthalpy: -2770.67690854 hartree
vibrat: 0.03666304 hartree
rotat: 0.01651473 hartree
transl: 0.02062016 hartree
total: 0.07483523 hartree
totalentropycorr: -0.07483523 hartree
gibbsenthalpy: -2770.75174377 hartree
gibbsminuselec: 0.07335341 hartree
