program: Orca
programVersion: 6.0.0
elementType: O O C O O C C C F F F F F F O H H Ni C N C H H H C N C H H H
charge: 0
multiplicity: 3
keywords: TPSS D3BJ TightOpt Freq def2-TZVPP def2/J RIJCOSX TightSCF defgrid3 CPCM(Acetonitrile)
frequency: 0.00 0.00 0.00 0.00 0.00 0.00 -9.72 7.44 15.85 21.01 22.27 25.33 29.50 44.48 46.03 53.05 54.71 77.79 103.23 111.37 119.39 134.54 164.61 169.39 191.60 198.00 204.02 214.92 222.07 241.14 267.31 272.41 303.14 306.68 310.94 395.79 398.49 404.42 406.33 411.36 413.14 414.81 461.46 469.66 493.40 494.35 581.87 583.28 622.66 694.53 694.62 766.82 767.65 799.98 803.18 883.18 942.04 942.68 972.81 1038.09 1038.39 1039.06 1039.66 1049.25 1049.32 1095.07 1095.42 1147.32 1151.79 1374.70 1374.79 1382.04 1382.84 1433.64 1433.73 1434.56 1434.88 1517.79 1618.87 1645.50 2325.55 2325.90 3020.29 3020.60 3098.08 3099.08 3099.26 3100.09 3195.33 3229.32
frequency: 7.44 15.85 21.01 22.27 25.33 29.50 44.48 46.03 53.05 54.71 77.79 103.23 111.37 119.39 134.54 164.61 169.39 191.60 198.00 204.02 214.92 222.07 241.14 267.31 272.41 303.14 306.68 310.94 395.79 398.49 404.42 406.33 411.36 413.14 414.81 461.46 469.66 493.40 494.35 581.87 583.28 622.66 694.53 694.62 766.82 767.65 799.98 803.18 883.18 942.04 942.68 972.81 1038.09 1038.39 1039.06 1039.66 1049.25 1049.32 1095.07 1095.42 1147.32 1151.79 1374.70 1374.79 1382.04 1382.84 1433.64 1433.73 1434.56 1434.88 1517.79 1618.87 1645.50 2325.55 2325.90 3020.29 3020.60 3098.08 3099.08 3099.26 3100.09 3195.33 3229.32
formula: C8H8F6N2NiO5
InChI: InChI=1/2C2F3O2.2C2H3N.Ni.H2O/c2*3-2(4,5)1(6)7;2*1-2-3;;/h;;2*1H3;;1H2/q2*-1;;;+2;/rC8H8F6N2NiO5/c1-3-15-17(20,16-4-2,21-5(18)7(9,10)11)22-6(19)8(12,13)14/h20H2,1-2H3
30 atoms
O  1.13085 0.759552 7.39951
O  0.37451 4.784413 4.738056
C  1.284538 5.555657 5.086952
O  2.720293 2.140509 8.268543
O  2.091672 5.475285 6.065679
C  2.133374 1.02833 8.083198
C  2.822036 -0.139902 8.856392
C  1.526726 6.834124 4.224486
F  4.113023 -0.292863 8.457126
F  2.201455 -1.324637 8.671275
F  2.841804 0.102545 10.193874
F  2.771238 6.816672 3.674996
F  0.642524 6.95487 3.211312
F  1.43662 7.961722 4.977413
O  0.285596 3.236661 6.905903
H  0.138081 3.593745 5.987146
H  0.39275 2.246035 6.877276
Ni 2.217387 3.773147 7.167423
C  3.263466 2.272023 4.611618
N  2.91069 2.837481 5.55434
C  3.700105 1.559411 3.429379
H  4.154916 2.263462 2.727468
H  4.431744 0.798343 3.713631
H  2.836771 1.080074 2.959439
C  1.786546 5.420617 9.799772
N  1.959937 4.819341 8.829479
C  1.566469 6.174088 11.016901
H  1.684685 5.513205 11.879751
H  2.293748 6.988335 11.076039
H  0.554516 6.588131 11.007525
totalener: -2903.65206995086282 hartree
nucrepener: 2491.70062221146145 hartree
electener: -5395.31452167816133 hartree
oneelecener: -8986.60578441709004 hartree
twoeener: 3591.29126273892871 hartree
cpcmener: -0.03817048416314 hartree
kineticenergy: 2895.93118883506622 hartree
exchangeener: -222.467906234628 hartree
correlationener: -6.929448268515 hartree
xcener: -229.397354503142 hartree
s2: 2.003412
dispersion: -0.037929927 hartree
elementType: O C F H Ni N
s2: 2.003413
energy: -8136.6040 -964.3243 -840.1814 -840.1312 -840.0609 -665.2104 -665.2095 -665.1924 -665.1922 -665.1909 -665.1897 -514.5493 -514.1846 -514.1829 -513.7932 -513.7920 -384.8210 -384.8100 -278.4457 -278.4448 -275.3602 -275.3591 -273.9571 -273.9443 -273.0360 -273.0337 -107.9586 -70.1288 -70.0875 -69.9092 -33.5504 -33.5498 -31.3425 -31.3420 -31.2982 -31.2972 -27.6382 -27.5889 -26.1824 -25.4324 -25.4209 -24.1280 -24.1026 -19.8355 -19.8248 -18.4727 -18.4710 -15.7289 -15.7272 -14.7181 -14.7173 -14.6913 -14.6901 -13.8395 -13.6624 -13.2625 -12.9344 -12.8394 -12.1748 -11.8674 -11.6566 -11.6093 -11.6048 -11.5902 -11.5828 -11.4540 -11.4206 -11.3363 -11.3227 -11.2953 -11.0185 -10.8504 -10.5990 -10.5705 -10.4706 -10.3430 -10.3404 -10.1651 -10.0808 -9.8049 -9.8037 -9.6217 -9.2203 -9.1748 -9.0616 -8.9234 -8.6872 -7.8777 -7.6421 -7.4831 -7.3111 -7.2620 -6.9395 -6.8736 -6.8701 -6.7231 -5.8138 -1.3460 -1.2672 -1.0430 -0.9080 -0.7444 -0.6375 0.2067 0.7120 1.4671 1.6658 2.2153 electronvolt
energy: -8136.5893 -963.4224 -839.4418 -839.3893 -839.3378 -665.2081 -665.2073 -665.1926 -665.1923 -665.1907 -665.1895 -514.4625 -514.1150 -514.1132 -513.7932 -513.7921 -384.7804 -384.7725 -278.4394 -278.4385 -275.3626 -275.3615 -273.9534 -273.9407 -273.0344 -273.0322 -105.8335 -68.0396 -67.9340 -67.8257 -33.5482 -33.5476 -31.3398 -31.3393 -31.2980 -31.2969 -27.5873 -27.5408 -26.0321 -25.3720 -25.3584 -24.0861 -24.0637 -19.8288 -19.8190 -18.4521 -18.4505 -15.7104 -15.6990 -14.7155 -14.7147 -14.6852 -14.6833 -13.7977 -13.5209 -13.2299 -12.8393 -12.7889 -12.0607 -11.6717 -11.6483 -11.6019 -11.5869 -11.5755 -11.4627 -11.4227 -11.4168 -11.3133 -11.2778 -11.2630 -11.0039 -10.8228 -10.5259 -10.4453 -10.3381 -10.3372 -10.1874 -10.1517 -10.0599 -9.8036 -9.8023 -9.2897 -9.1399 -9.0618 -9.0273 -8.6262 -7.8802 -7.6565 -7.4054 -7.3685 -6.9549 -6.8917 -6.5329 -6.4407 -6.2714 -4.2064 -3.2805 -1.3027 -1.2421 -0.9476 -0.8769 -0.6837 -0.5913 0.2666 0.7140 1.5890 electronvolt
chargesum: -0.0000000
charge: -0.441031 -0.440976 0.304118 -0.452953 -0.452794 0.304289 0.403304 0.403410 -0.159363 -0.152888 -0.158664 -0.159837 -0.152936 -0.158229 -0.436680 0.254381 0.254336 0.578151 -0.108697 0.091951 -0.022415 0.117159 0.117322 0.118597 -0.097376 0.112972 -0.016997 0.117074 0.117446 0.117324
charge: 0.077836 0.077515 -0.552179 0.136890 0.136995 -0.552057 -0.625299 -0.625305 0.177820 0.192257 0.178718 0.177095 0.192243 0.179390 0.407770 -0.140700 -0.141013 -0.111150 -0.028362 0.212219 0.055435 0.056454 0.056521 0.057171 -0.029358 0.209154 0.054782 0.056063 0.056484 0.056612
qa: -0.4410 -0.4410 0.3041 -0.4530 -0.4528 0.3043 0.4033 0.4034 -0.1594 -0.1529 -0.1587 -0.1598 -0.1529 -0.1582 -0.4367 0.2544 0.2543 0.5782 -0.1087 0.0920 -0.0224 0.1172 0.1173 0.1186 -0.0974 0.1130 -0.0170 0.1171 0.1174 0.1173
va: 2.0578 2.0578 4.2174 2.0289 2.0288 4.2173 4.5417 4.5413 1.1424 1.1621 1.1439 1.1415 1.1621 1.1447 2.0887 1.0547 1.0548 3.7014 3.8003 3.1502 3.9095 1.0037 1.0036 1.0037 3.7516 3.1227 3.9115 1.0038 1.0039 1.0037
dispersion: -0.037929569 hartree
energy: -2903.689999949640 hartree
dipole: -1.949393680 3.479139816 1.529746136 1.036459632 -0.264746162 0.771713470 2.289889696 -1.512803493 0.777086203
dipolemethod: SCF
magnitude: 1.881363306 au
magnitude: 4.782045487 debye
temp: 298.15 k
press: 1.00 atm
zeropoint: 0.17095577 hartree
thermalvibcorrection: 0.02363474 hartree
thermalrotcorrection: 0.00141627 hartree
thermaltrasncorrection: 0.00141627 hartree
thermaltotal: -2903.49257689 hartree
thermalcorr: 0.02646729 hartree
nonthermalcorr: 0.17095577 hartree
totalcorr: 0.19742306 hartree
thermalcorrenthalpy: 0.00094421 hartree
totalenthalpy: -2903.49163269 hartree
vibrat: 0.04521550 hartree
rotat: 0.01679982 hartree
transl: 0.02077992 hartree
total: 0.08383253 hartree
totalentropycorr: -0.08383253 hartree
gibbsenthalpy: -2903.57546522 hartree
gibbsminuselec: 0.11453473 hartree
