program: Orca
programVersion: 6.0.0
elementType: O O C O O C C C F F F F F F O H H Ni C N C H H H C N C H H H
charge: 0
multiplicity: 3
keywords: TPSS D3BJ TightOpt Freq def2-TZVPP def2/J RIJCOSX TightSCF defgrid3 CPCM(Acetonitrile)
frequency: 0.00 0.00 0.00 0.00 0.00 0.00 13.23 14.31 17.98 22.64 26.79 29.35 32.18 36.18 41.09 46.35 51.46 76.92 95.24 113.38 121.07 133.37 166.36 170.40 184.22 185.93 196.48 224.73 248.21 254.58 262.72 266.47 289.28 308.84 310.73 394.51 398.82 401.74 405.37 406.93 413.65 417.57 462.99 469.97 493.40 494.38 582.25 583.66 655.64 695.04 699.44 767.51 769.58 795.57 805.77 857.29 942.18 945.60 969.55 1037.65 1037.69 1038.50 1038.58 1049.51 1050.35 1095.52 1095.80 1146.60 1151.21 1374.25 1374.63 1380.63 1381.34 1433.50 1433.70 1435.15 1435.31 1518.02 1616.07 1646.32 2326.59 2331.08 3020.35 3020.41 3098.26 3098.85 3099.26 3099.60 3187.16 3218.71
frequency: 13.23 14.31 17.98 22.64 26.79 29.35 32.18 36.18 41.09 46.35 51.46 76.92 95.24 113.38 121.07 133.37 166.36 170.40 184.22 185.93 196.48 224.73 248.21 254.58 262.72 266.47 289.28 308.84 310.73 394.51 398.82 401.74 405.37 406.93 413.65 417.57 462.99 469.97 493.40 494.38 582.25 583.66 655.64 695.04 699.44 767.51 769.58 795.57 805.77 857.29 942.18 945.60 969.55 1037.65 1037.69 1038.50 1038.58 1049.51 1050.35 1095.52 1095.80 1146.60 1151.21 1374.25 1374.63 1380.63 1381.34 1433.50 1433.70 1435.15 1435.31 1518.02 1616.07 1646.32 2326.59 2331.08 3020.35 3020.41 3098.26 3098.85 3099.26 3099.60 3187.16 3218.71
formula: C8H8F6N2NiO5
InChI: InChI=1/2C2F3O2.2C2H3N.Ni.H2O/c2*3-2(4,5)1(6)7;2*1-2-3;;/h;;2*1H3;;1H2/q2*-1;;;+2;/rC8H8F6N2NiO5/c1-3-15-17(20,16-4-2,21-5(18)7(9,10)11)22-6(19)8(12,13)14/h20H2,1-2H3
30 atoms
O  1.309725 1.021375 7.558226
O  0.205413 4.817438 4.633812
C  1.081409 5.662083 4.88559
O  2.916702 2.519028 8.166917
O  2.006724 5.646185 5.758046
C  2.321243 1.395183 8.175671
C  3.021682 0.36419 9.11548
C  1.108384 6.962468 4.02225
F  4.274726 0.079762 8.667622
F  2.350049 -0.804195 9.198312
F  3.147422 0.850071 10.377636
F  2.264919 7.043193 3.310137
F  0.088441 7.022981 3.139601
F  1.037746 8.073726 4.800424
O  0.553008 3.457519 6.871887
H  0.226983 3.733175 5.971346
H  0.596038 2.464641 6.946325
Ni 2.492958 3.980515 6.818136
C  3.318391 2.296937 4.327068
N  3.040443 2.931698 5.250031
C  3.666248 1.499826 3.169308
H  3.942184 2.160962 2.3434
H  4.510261 0.850499 3.417109
H  2.806781 0.889471 2.879129
C  5.247115 5.328366 7.50856
N  4.236667 4.829983 7.256626
C  6.514443 5.954898 7.823662
H  6.729178 5.824734 8.887764
H  7.305933 5.487907 7.231132
H  6.4608 7.02105 7.587547
totalener: -2903.65361924827266 hartree
nucrepener: 2483.35158136630525 hartree
electener: -5386.96531109901662 hartree
oneelecener: -8969.73473853624091 hartree
twoeener: 3582.76942743722429 hartree
cpcmener: -0.03988951556175 hartree
kineticenergy: 2895.94014175986104 hartree
exchangeener: -222.468296418387 hartree
correlationener: -6.929217114911 hartree
xcener: -229.397513533298 hartree
s2: 2.003678
dispersion: -0.037361416 hartree
elementType: O C F H Ni N
s2: 2.003677
energy: -8136.6857 -964.4341 -840.3185 -840.2037 -840.1752 -665.2122 -665.2116 -665.1970 -665.1969 -665.1947 -665.1943 -514.4993 -514.1866 -514.1849 -513.8196 -513.8185 -384.8953 -384.8006 -278.4514 -278.4510 -275.3799 -275.3798 -273.9721 -273.9297 -273.0432 -273.0332 -108.0682 -70.3046 -70.1158 -70.0256 -33.5544 -33.5542 -31.3458 -31.3457 -31.3030 -31.3025 -27.6603 -27.6032 -26.1315 -25.4495 -25.4394 -24.1724 -24.0892 -19.8424 -19.8212 -18.4794 -18.4767 -15.7440 -15.7316 -14.7231 -14.7224 -14.6945 -14.6939 -13.8524 -13.6330 -13.3589 -12.9401 -12.8666 -12.1307 -11.9243 -11.6757 -11.6404 -11.6179 -11.5999 -11.5720 -11.4921 -11.4307 -11.4280 -11.3244 -11.3023 -11.0087 -10.9892 -10.5992 -10.5073 -10.4503 -10.3486 -10.3441 -10.1507 -10.1203 -9.8075 -9.8070 -9.5486 -9.2360 -9.1869 -9.1114 -8.8019 -8.6375 -8.0318 -7.6784 -7.5773 -7.3643 -7.2598 -7.0827 -6.8953 -6.8772 -6.7261 -5.8665 -1.3607 -1.2965 -0.9698 -0.8983 -0.7327 -0.6917 0.1929 0.7839 1.1159 1.9747 2.1918 electronvolt
energy: -8136.6708 -963.5228 -839.5583 -839.4662 -839.4454 -665.2101 -665.2096 -665.1973 -665.1971 -665.1942 -665.1938 -514.4283 -514.1230 -514.1214 -513.8183 -513.8172 -384.8358 -384.7639 -278.4459 -278.4455 -275.3808 -275.3806 -273.9717 -273.9267 -273.0409 -273.0318 -105.9209 -68.1628 -67.9688 -67.9218 -33.5523 -33.5521 -31.3432 -31.3432 -31.3025 -31.3020 -27.6128 -27.5583 -26.0088 -25.3916 -25.3805 -24.1182 -24.0492 -19.8344 -19.8152 -18.4614 -18.4562 -15.7261 -15.7035 -14.7205 -14.7198 -14.6884 -14.6879 -13.8165 -13.5558 -13.2459 -12.8462 -12.8200 -12.0638 -11.6846 -11.6330 -11.6166 -11.5939 -11.5560 -11.4607 -11.4242 -11.4107 -11.3303 -11.2893 -11.2292 -10.9901 -10.9438 -10.5361 -10.4285 -10.3434 -10.3387 -10.2981 -10.1369 -10.0946 -9.8063 -9.8057 -9.4156 -9.1552 -9.0452 -8.9922 -8.5313 -7.8603 -7.7580 -7.4316 -7.4211 -6.9822 -6.8850 -6.5910 -6.4957 -6.2837 -4.2411 -3.3701 -1.2985 -1.2671 -0.8996 -0.8570 -0.6728 -0.6462 0.2512 0.7896 1.2340 electronvolt
chargesum: 0.0000000
charge: -0.435446 -0.435145 0.296956 -0.446035 -0.446134 0.296909 0.407265 0.407159 -0.159820 -0.152604 -0.157655 -0.159721 -0.152544 -0.157772 -0.412034 0.251104 0.251523 0.610936 -0.116290 0.069039 -0.019019 0.117275 0.117316 0.117830 -0.114842 0.086294 -0.015108 0.117076 0.116748 0.116736
charge: 0.078737 0.078858 -0.548754 0.134860 0.134884 -0.548840 -0.625374 -0.625357 0.177017 0.192348 0.180385 0.177187 0.192391 0.180156 0.402884 -0.144164 -0.143855 -0.116537 -0.026781 0.221277 0.055516 0.056570 0.056576 0.056662 -0.031023 0.211190 0.054454 0.056231 0.056411 0.056088
qa: -0.4354 -0.4351 0.2970 -0.4460 -0.4461 0.2969 0.4073 0.4072 -0.1598 -0.1526 -0.1577 -0.1597 -0.1525 -0.1578 -0.4120 0.2511 0.2515 0.6109 -0.1163 0.0690 -0.0190 0.1173 0.1173 0.1178 -0.1148 0.0863 -0.0151 0.1171 0.1167 0.1167
va: 2.0639 2.0645 4.2314 2.0344 2.0342 4.2312 4.5422 4.5423 1.1413 1.1624 1.1456 1.1415 1.1625 1.1454 2.1116 1.0579 1.0573 3.7418 3.8015 3.1186 3.9090 1.0036 1.0035 1.0036 3.7868 3.1120 3.9100 1.0039 1.0037 1.0039
dispersion: -0.037361206 hartree
energy: -2903.690980676207 hartree
dipole: 13.446773454 -8.735148775 4.711624679 -1.866762475 2.100688265 0.233925790 -7.584669261 6.089392689 -1.495276572
dipolemethod: SCF
magnitude: 4.948735235 au
magnitude: 12.578685322 debye
temp: 298.15 k
press: 1.00 atm
zeropoint: 0.17095249 hartree
thermalvibcorrection: 0.02454946 hartree
thermalrotcorrection: 0.00141627 hartree
thermaltrasncorrection: 0.00141627 hartree
thermaltotal: -2903.49264618 hartree
thermalcorr: 0.02738200 hartree
nonthermalcorr: 0.17095249 hartree
totalcorr: 0.19833450 hartree
thermalcorrenthalpy: 0.00094421 hartree
totalenthalpy: -2903.49170197 hartree
vibrat: 0.04714096 hartree
rotat: 0.01680458 hartree
transl: 0.02077992 hartree
total: 0.08576275 hartree
totalentropycorr: -0.08576275 hartree
gibbsenthalpy: -2903.57746472 hartree
gibbsminuselec: 0.11351595 hartree
