program: Orca
programVersion: 6.0.0
elementType: O O C O O C C C F F F F F F O H H Ni C N C H H H C N C H H H
charge: 0
multiplicity: 3
keywords: TPSS D3BJ TightOpt Freq def2-TZVPP def2/J RIJCOSX TightSCF defgrid3 CPCM(Acetonitrile)
frequency: 0.00 0.00 0.00 0.00 0.00 0.00 12.01 17.84 19.15 20.09 27.01 27.60 30.45 37.37 42.76 46.25 69.75 77.34 104.27 109.34 116.33 143.85 149.46 168.58 180.26 210.79 215.89 218.78 238.16 249.75 261.61 263.47 276.55 310.01 313.82 379.74 397.67 402.23 402.42 414.34 416.13 424.57 467.47 479.28 493.48 494.84 585.40 588.80 652.01 692.97 695.49 765.58 767.02 799.87 802.19 932.67 937.88 942.76 1001.34 1036.73 1038.54 1039.29 1040.40 1051.26 1053.43 1096.36 1098.43 1147.65 1152.49 1368.31 1380.07 1380.83 1382.42 1433.45 1435.07 1435.16 1436.16 1606.99 1623.74 1640.26 2322.84 2326.21 3020.72 3020.77 3092.22 3098.44 3098.96 3099.50 3100.12 3183.17
frequency: 12.01 17.84 19.15 20.09 27.01 27.60 30.45 37.37 42.76 46.25 69.75 77.34 104.27 109.34 116.33 143.85 149.46 168.58 180.26 210.79 215.89 218.78 238.16 249.75 261.61 263.47 276.55 310.01 313.82 379.74 397.67 402.23 402.42 414.34 416.13 424.57 467.47 479.28 493.48 494.84 585.40 588.80 652.01 692.97 695.49 765.58 767.02 799.87 802.19 932.67 937.88 942.76 1001.34 1036.73 1038.54 1039.29 1040.40 1051.26 1053.43 1096.36 1098.43 1147.65 1152.49 1368.31 1380.07 1380.83 1382.42 1433.45 1435.07 1435.16 1436.16 1606.99 1623.74 1640.26 2322.84 2326.21 3020.72 3020.77 3092.22 3098.44 3098.96 3099.50 3100.12 3183.17
formula: C8H8F6N2NiO5
InChI: InChI=1/2C2F3O2.2C2H3N.Ni.H2O/c2*3-2(4,5)1(6)7;2*1-2-3;;/h;;2*1H3;;1H2/q2*-1;;;+2;/rC8H8F6N2NiO5/c1-3-15-17(20,16-4-2,21-5(18)7(9,10)11)22-6(19)8(12,13)14/h20H2,1-2H3
30 atoms
O  0.295964 2.244103 8.036361
O  1.953112 2.105151 4.106044
C  3.15406 2.080013 4.425346
O  2.573147 2.14894 8.107124
O  3.754873 2.637387 5.396176
C  1.38972 1.807804 8.428065
C  1.384481 0.661389 9.488729
C  4.126622 1.246681 3.532638
F  2.067932 -0.424043 9.043038
F  0.136751 0.253639 9.800859
F  1.979551 1.067715 10.641526
F  4.708054 0.249514 4.250833
F  3.504801 0.674854 2.479686
F  5.1270 2.023542 3.040512
O  1.124103 3.75543 5.993328
H  1.246335 3.119454 5.228246
H  0.597374 3.257362 6.679498
Ni 2.944713 3.704371 6.907076
C  5.897496 4.113658 7.954787
N  4.820364 3.964241 7.566651
C  7.249199 4.300236 8.441614
H  7.225376 4.474401 9.520705
H  7.839331 3.405304 8.227065
H  7.698385 5.162935 7.942056
C  1.843577 5.856849 8.937752
N  2.261376 5.086484 8.185745
C  1.317628 6.822786 9.880476
H  2.114777 7.142189 10.556977
H  0.930244 7.687805 9.335415
H  0.510158 6.362195 10.456278
totalener: -2903.65465655625940 hartree
nucrepener: 2498.55804071466082 hartree
electener: -5402.16841309084884 hartree
oneelecener: -9000.95416381738141 hartree
twoeener: 3598.78575072653211 hartree
cpcmener: -0.04428418007182 hartree
kineticenergy: 2895.93397614571131 hartree
exchangeener: -222.468314563987 hartree
correlationener: -6.928605396693 hartree
xcener: -229.396919960680 hartree
s2: 2.003552
dispersion: -0.036962745 hartree
dispersion: -0.036963168 hartree
s2: 2.003553
dispersion: -0.036963487 hartree
dispersion: -0.036963552 hartree
dispersion: -0.036962609 hartree
dispersion: -0.036962665 hartree
elementType: O C F H Ni N
energy: -8136.5909 -964.3083 -840.1601 -840.0948 -840.0698 -665.2475 -665.2267 -665.2255 -665.2173 -665.2005 -665.1981 -514.3704 -514.3417 -514.2131 -513.8877 -513.8677 -384.7827 -384.7561 -278.5099 -278.4623 -275.4450 -275.4210 -273.9137 -273.8891 -273.0301 -273.0219 -107.9451 -70.0956 -70.0166 -69.9714 -33.5961 -33.5622 -31.3854 -31.3527 -31.3392 -31.3091 -27.7494 -27.6613 -26.0256 -25.5530 -25.4825 -24.1030 -24.0328 -19.8193 -19.8017 -18.5294 -18.4931 -15.7867 -15.7566 -14.7597 -14.7351 -14.7284 -14.7041 -13.7038 -13.5065 -13.2328 -13.0192 -12.9432 -12.1631 -11.7211 -11.6564 -11.6246 -11.5878 -11.5678 -11.5624 -11.5061 -11.4747 -11.4267 -11.3512 -11.3118 -11.1052 -10.9693 -10.7442 -10.4756 -10.3957 -10.3738 -10.3536 -10.1815 -10.1199 -9.8356 -9.8101 -9.3170 -9.2866 -9.1132 -8.9242 -8.8027 -8.6708 -8.0934 -7.9797 -7.5562 -7.3680 -7.3365 -6.9022 -6.8418 -6.7949 -6.5654 -5.9618 -1.3719 -1.3526 -0.9879 -0.9341 -0.6626 -0.5629 0.1740 0.8611 1.1079 1.9739 2.2665 electronvolt
energy: -8136.5762 -963.4044 -839.4236 -839.3537 -839.3380 -665.2442 -665.2263 -665.2255 -665.2152 -665.2007 -665.1977 -514.2830 -514.2716 -514.1548 -513.8865 -513.8665 -384.7401 -384.7162 -278.4998 -278.4570 -275.4487 -275.4213 -273.9111 -273.8867 -273.0285 -273.0204 -105.8152 -68.0161 -67.8729 -67.8539 -33.5926 -33.5601 -31.3814 -31.3501 -31.3385 -31.3088 -27.6894 -27.6152 -25.9064 -25.4742 -25.4262 -24.0623 -23.9928 -19.8131 -19.7956 -18.4985 -18.4742 -15.7548 -15.7333 -14.7557 -14.7266 -14.7253 -14.6973 -13.6246 -13.4614 -13.1681 -12.9423 -12.8491 -12.1042 -11.6531 -11.6085 -11.5762 -11.5698 -11.5075 -11.4857 -11.4470 -11.4223 -11.3216 -11.2999 -11.1561 -11.0678 -10.9524 -10.6795 -10.4512 -10.3767 -10.3481 -10.2168 -10.1244 -10.0985 -9.8341 -9.8090 -9.2417 -9.1581 -9.0227 -8.7881 -8.6239 -7.8877 -7.7436 -7.5726 -7.4490 -7.0618 -6.9601 -6.4496 -6.3437 -6.3050 -4.1781 -3.2973 -1.3370 -1.3077 -0.9116 -0.8791 -0.6147 -0.5305 0.2306 0.8621 1.1995 electronvolt
chargesum: 0.0000000
charge: -0.426366 -0.418525 0.266192 -0.447232 -0.440363 0.275687 0.405470 0.412851 -0.155876 -0.150692 -0.157495 -0.158502 -0.152202 -0.158361 -0.429988 0.252529 0.253863 0.634596 -0.113630 0.071977 -0.015174 0.116187 0.116701 0.116884 -0.107120 0.075532 -0.017086 0.116359 0.117117 0.116665
charge: 0.087531 0.090366 -0.543013 0.153925 0.137759 -0.544081 -0.626036 -0.625397 0.182234 0.195155 0.179874 0.179279 0.193111 0.179843 0.378264 -0.156787 -0.145787 -0.111461 -0.034570 0.209316 0.053638 0.055683 0.055819 0.056142 -0.032837 0.209671 0.054132 0.055697 0.056194 0.056336
qa: -0.4264 -0.4185 0.2662 -0.4472 -0.4404 0.2757 0.4055 0.4129 -0.1559 -0.1507 -0.1575 -0.1585 -0.1522 -0.1584 -0.4300 0.2525 0.2539 0.6346 -0.1136 0.0720 -0.0152 0.1162 0.1167 0.1169 -0.1071 0.0755 -0.0171 0.1164 0.1171 0.1167
va: 2.0706 2.0845 4.2751 2.0288 2.0306 4.2723 4.5498 4.5325 1.1481 1.1661 1.1452 1.1434 1.1633 1.1445 2.0964 1.0680 1.0581 3.6440 3.7834 3.0845 3.9103 1.0039 1.0039 1.0040 3.7768 3.1275 3.9086 1.0037 1.0037 1.0040
dispersion: -0.036962584 hartree
energy: -2903.691619683076 hartree
dipole: 4.351302693 -1.529489184 2.821813509 26.720236553 -21.150523380 5.569713173 13.925332511 -10.091033591 3.834298920
dipolemethod: SCF
magnitude: 7.327085677 au
magnitude: 18.623971719 debye
temp: 298.15 k
press: 1.00 atm
zeropoint: 0.17116941 hartree
thermalvibcorrection: 0.02447627 hartree
thermalrotcorrection: 0.00141627 hartree
thermaltrasncorrection: 0.00141627 hartree
thermaltotal: -2903.49314146 hartree
thermalcorr: 0.02730881 hartree
nonthermalcorr: 0.17116941 hartree
totalcorr: 0.19847822 hartree
thermalcorrenthalpy: 0.00094421 hartree
totalenthalpy: -2903.49219726 hartree
vibrat: 0.04697797 hartree
rotat: 0.01680175 hartree
transl: 0.02077992 hartree
total: 0.08559693 hartree
totalentropycorr: -0.08559693 hartree
gibbsenthalpy: -2903.57779419 hartree
gibbsminuselec: 0.11382549 hartree
