program: Orca
programVersion: 6.0.0
elementType: O O C O O C C C F F F F F F O H H Ni
charge: 0
multiplicity: 3
keywords: b3lyp d3bj def2-TZVPP def2/J RIJCOSX TightSCF defgrid3 CPCM(Acetonitrile)
formula: C4H2F6NiO5
InChI: InChI=1/2C2F3O2.Ni.H2O/c2*3-2(4,5)1(6)7;;/h;;;1H2/q2*-2;+4;/rC4H2F6NiO5/c5-3(6,7)1-13-11(12,14-1)15-2(16-11)4(8,9)10/h12H2
18 atoms
O  1.368005 1.97317 7.905925
O  3.000267 5.65208 7.054064
C  2.12395 5.741391 6.147298
O  3.118778 2.777916 8.993014
O  1.209779 4.878724 6.010646
C  2.31363 1.838993 8.734751
C  2.470858 0.473806 9.442313
C  2.1494 6.971348 5.212245
F  2.662489 -0.510093 8.531734
F  1.351872 0.174298 10.14366
F  3.512745 0.461458 10.294439
F  1.551529 8.02251 5.829095
F  3.413419 7.334732 4.91049
F  1.491979 6.739897 4.059407
O  0.825472 4.72426 9.04637
H  0.088336 5.2242 8.653018
H  1.30083 5.365201 9.604258
Ni 2.035436 3.916275 7.645943
elementType: O C F H Ni
totalener: -2637.26466971671380 hartree
nucrepener: 1640.27291324667976 hartree
electener: -4277.50654476293494 hartree
oneelecener: -6924.98732637260764 hartree
twoeener: 2647.48078160967316 hartree
cpcmener: -0.03103786812468 hartree
kineticenergy: 2630.76074146972678 hartree
exchangeener: -147.296234183921 hartree
correlationener: -6.762496277353 hartree
xcener: -154.058730461274 hartree
s2: 2.003143
energy: -8161.5563 -976.1249 -851.5474 -851.5335 -851.4293 -673.0215 -673.0181 -673.0129 -673.0092 -672.9978 -672.9972 -522.1877 -521.3371 -521.3174 -521.3151 -521.2648 -284.3154 -284.2953 -281.3213 -281.2894 -112.8150 -74.5905 -74.5194 -74.2353 -36.1907 -36.1735 -33.8891 -33.8702 -33.8410 -33.8260 -30.5367 -30.4560 -29.0774 -27.7811 -27.7466 -20.7342 -20.6936 -17.8207 -17.7603 -16.6982 -16.6816 -16.6770 -16.6592 -15.7849 -14.7962 -14.6156 -13.9647 -13.6763 -13.6098 -13.4619 -13.4020 -13.2901 -13.2385 -13.1046 -13.0212 -12.8827 -12.6318 -12.3162 -12.2980 -12.2011 -12.1146 -11.7836 -11.7663 -11.4754 -11.3619 -10.7317 -10.5806 -10.2098 -10.1509 -9.2939 -9.1246 -9.0742 -9.0452 -8.8556 -7.9239 -1.3081 -1.1155 -0.1413 1.0731 2.1119 2.5210 2.7443 2.8905 2.9630 3.4409 3.7284 electronvolt
energy: -8161.5322 -974.8956 -850.5244 -850.4809 -850.4686 -673.0205 -673.0174 -673.0124 -673.0080 -672.9976 -672.9965 -522.1324 -521.2866 -521.2664 -521.2653 -521.2153 -284.3156 -284.2956 -281.3242 -281.2923 -110.1668 -71.7269 -71.6565 -71.5636 -36.1893 -36.1721 -33.8873 -33.8681 -33.8398 -33.8251 -30.4493 -30.3691 -28.9692 -27.6706 -27.6383 -20.7160 -20.6780 -17.7961 -17.7422 -16.6975 -16.6810 -16.6705 -16.6529 -15.7407 -14.7388 -14.5730 -13.5509 -13.5196 -13.4639 -13.4397 -13.2319 -13.2145 -13.1772 -12.9624 -12.8445 -12.6534 -12.5389 -12.3075 -12.2878 -12.1448 -12.0455 -11.7815 -11.7640 -10.6702 -9.9812 -9.7914 -9.5037 -9.4135 -9.0376 -9.0110 -8.9004 -8.8442 -8.4833 -3.1526 -2.5628 -1.2407 -1.0899 0.0139 1.2048 2.1328 2.5348 2.7903 2.9780 3.0083 electronvolt
chargesum: 0.0000000
charge: -0.458612 -0.449949 0.350077 -0.444478 -0.449691 0.359264 0.510396 0.508544 -0.173647 -0.173722 -0.168757 -0.176054 -0.169810 -0.168637 -0.363455 0.270615 0.276419 0.921496
charge: 0.117022 0.118373 -0.498805 0.120804 0.119034 -0.499279 -0.601907 -0.602170 0.187444 0.187464 0.198839 0.183612 0.194236 0.197472 0.452813 -0.040036 -0.038137 0.203222
qa: -0.4586 -0.4499 0.3501 -0.4445 -0.4497 0.3593 0.5104 0.5085 -0.1736 -0.1737 -0.1688 -0.1761 -0.1698 -0.1686 -0.3635 0.2706 0.2764 0.9215
va: 2.0263 2.0253 4.0349 2.0335 2.0211 4.0123 4.4765 4.4774 1.1289 1.1293 1.1411 1.1243 1.1366 1.1399 2.2176 0.9847 0.9840 3.2860
dispersion: -0.026756170 hartree
energy: -2637.291425886581 hartree
dipole: -3.531702161 2.646186741 -0.885515420 3.323344962 -1.910998456 1.412346506 3.996383470 -3.047519945 0.948863525
dipolemethod: SCF
magnitude: 1.918124657 au
magnitude: 4.875485417 debye
