program: Orca
programVersion: 6.0.0
elementType: O O C O O C C C F F F F F F O H H Ni
charge: 0
multiplicity: 3
keywords: TPSS D3BJ TightOpt Freq def2-TZVPP def2/J RIJCOSX TightSCF defgrid3 CPCM(Acetonitrile)
frequency: 0.00 0.00 0.00 0.00 0.00 0.00 12.77 19.88 27.12 46.90 63.58 91.92 105.39 116.56 123.10 131.22 141.54 165.11 188.56 264.48 282.56 283.55 287.12 319.89 382.23 416.93 422.53 445.83 463.42 495.02 496.17 563.76 570.28 571.61 661.24 703.55 708.55 767.31 768.86 836.82 841.73 1066.52 1069.27 1110.47 1113.85 1153.96 1158.42 1448.34 1448.53 1554.12 1555.91 1604.06 3657.14 3731.47
frequency: 12.77 19.88 27.12 46.90 63.58 91.92 105.39 116.56 123.10 131.22 141.54 165.11 188.56 264.48 282.56 283.55 287.12 319.89 382.23 416.93 422.53 445.83 463.42 495.02 496.17 563.76 570.28 571.61 661.24 703.55 708.55 767.31 768.86 836.82 841.73 1066.52 1069.27 1110.47 1113.85 1153.96 1158.42 1448.34 1448.53 1554.12 1555.91 1604.06 3657.14 3731.47
formula: C4H2F6NiO5
InChI: InChI=1/2C2F3O2.Ni.H2O/c2*3-2(4,5)1(6)7;;/h;;;1H2/q2*-2;+4;/rC4H2F6NiO5/c5-3(6,7)1-13-11(12,14-1)15-2(16-11)4(8,9)10/h12H2
18 atoms
O  1.368005 1.97317 7.905925
O  3.000267 5.65208 7.054064
C  2.12395 5.741391 6.147298
O  3.118778 2.777916 8.993014
O  1.209779 4.878724 6.010646
C  2.31363 1.838993 8.734751
C  2.470858 0.473806 9.442313
C  2.1494 6.971348 5.212245
F  2.662489 -0.510093 8.531734
F  1.351872 0.174298 10.14366
F  3.512745 0.461458 10.294439
F  1.551529 8.02251 5.829095
F  3.413419 7.334732 4.91049
F  1.491979 6.739897 4.059407
O  0.825472 4.72426 9.04637
H  0.088336 5.2242 8.653018
H  1.30083 5.365201 9.604258
Ni 2.035436 3.916275 7.645943
totalener: -2637.93389021119947 hartree
nucrepener: 1639.81290794536744 hartree
electener: -4277.71737352902255 hartree
oneelecener: -6924.53594704489660 hartree
twoeener: 2646.81857351587405 hartree
cpcmener: -0.02942462754472 hartree
kineticenergy: 2631.41348177302325 hartree
exchangeener: -186.140268207530 hartree
correlationener: -5.494625676031 hartree
xcener: -191.634893883561 hartree
s2: 2.002196
dispersion: -0.019604767 hartree
dispersion: -0.019603442 hartree
dispersion: -0.019599628 hartree
s2: 2.002197
dispersion: -0.019596576 hartree
dispersion: -0.019590111 hartree
dispersion: -0.019585536 hartree
dispersion: -0.019581259 hartree
dispersion: -0.019578590 hartree
dispersion: -0.019576554 hartree
dispersion: -0.019572125 hartree
dispersion: -0.019566175 hartree
dispersion: -0.019565885 hartree
s2: 2.002198
dispersion: -0.019555018 hartree
s2: 2.002199
dispersion: -0.019554731 hartree
s2: 2.002200
dispersion: -0.019552237 hartree
s2: 2.002201
dispersion: -0.019546614 hartree
s2: 2.002202
dispersion: -0.019538997 hartree
s2: 2.002204
dispersion: -0.019530468 hartree
dispersion: -0.019536059 hartree
dispersion: -0.019542228 hartree
s2: 2.002205
dispersion: -0.019559258 hartree
s2: 2.002206
dispersion: -0.019567396 hartree
s2: 2.002207
dispersion: -0.019581450 hartree
dispersion: -0.019586339 hartree
dispersion: -0.019586515 hartree
dispersion: -0.019584868 hartree
dispersion: -0.019583553 hartree
dispersion: -0.019583567 hartree
dispersion: -0.019585199 hartree
dispersion: -0.019587782 hartree
dispersion: -0.019592118 hartree
dispersion: -0.019595166 hartree
dispersion: -0.019598444 hartree
dispersion: -0.019600654 hartree
dispersion: -0.019602300 hartree
dispersion: -0.019601212 hartree
dispersion: -0.019595786 hartree
dispersion: -0.019595165 hartree
dispersion: -0.019593843 hartree
dispersion: -0.019593346 hartree
dispersion: -0.019592273 hartree
dispersion: -0.019591560 hartree
dispersion: -0.019591026 hartree
dispersion: -0.019591049 hartree
dispersion: -0.019591377 hartree
dispersion: -0.019591697 hartree
elementType: O C F H Ni
energy: -8136.7958 -964.4092 -840.2778 -840.2296 -840.1320 -665.5169 -665.5160 -665.5047 -665.5001 -665.4922 -665.4901 -515.6561 -514.7651 -514.7519 -514.7517 -514.7008 -278.9411 -278.9208 -275.9649 -275.9355 -108.1184 -70.3398 -70.3184 -69.9855 -33.9154 -33.8986 -31.6958 -31.6767 -31.6451 -31.6315 -28.5559 -28.4813 -27.3049 -25.9136 -25.8829 -19.0445 -19.0055 -16.1764 -16.1216 -15.0704 -15.0548 -15.0448 -15.0275 -14.4833 -13.2777 -13.1292 -12.2860 -12.1552 -12.1298 -11.8962 -11.7494 -11.5907 -11.5754 -11.4952 -11.4248 -11.3962 -11.0690 -10.6385 -10.6205 -10.5335 -10.4941 -10.0915 -10.0752 -9.6002 -9.3498 -9.1741 -8.4570 -8.2893 -7.9699 -7.8702 -7.5451 -7.4644 -7.2513 -7.1751 -6.2084 -2.0352 -1.8644 -0.5039 0.6908 1.5948 2.1244 2.1660 2.3954 2.4538 2.9684 3.1326 electronvolt
energy: -8136.7815 -963.5180 -839.5306 -839.4817 -839.4487 -665.5157 -665.5151 -665.5031 -665.4992 -665.4911 -665.4898 -515.5935 -514.7069 -514.6938 -514.6932 -514.6438 -278.9408 -278.9206 -275.9675 -275.9380 -106.0016 -68.2134 -68.1368 -67.9866 -33.9136 -33.8969 -31.6936 -31.6742 -31.6434 -31.6303 -28.4688 -28.3952 -27.2015 -25.8062 -25.7772 -19.0267 -18.9899 -16.1562 -16.1056 -15.0693 -15.0537 -15.0393 -15.0220 -14.4438 -13.2272 -13.0842 -12.0875 -12.0525 -11.9972 -11.8648 -11.6607 -11.5736 -11.5573 -11.4733 -11.3748 -11.1756 -10.9952 -10.6329 -10.6145 -10.5183 -10.4714 -10.0899 -10.0736 -9.2850 -8.7413 -8.2391 -8.2184 -8.1022 -7.9167 -7.6558 -6.8041 -6.6708 -6.5291 -4.4914 -3.8363 -1.9867 -1.8357 -0.3399 0.8762 1.6216 2.1664 2.1842 2.4363 2.5387 electronvolt
chargesum: -0.0000000
charge: -0.416792 -0.407918 0.344450 -0.402797 -0.408591 0.350827 0.406908 0.404790 -0.144738 -0.144705 -0.140349 -0.146879 -0.141220 -0.140163 -0.368966 0.282646 0.289407 0.784091
charge: 0.140865 0.142102 -0.518030 0.144169 0.142567 -0.518285 -0.631196 -0.631475 0.197672 0.197814 0.208779 0.194072 0.204306 0.207452 0.464318 -0.038931 -0.037050 0.130851
qa: -0.4168 -0.4079 0.3445 -0.4028 -0.4086 0.3508 0.4069 0.4048 -0.1447 -0.1447 -0.1403 -0.1469 -0.1412 -0.1402 -0.3690 0.2826 0.2894 0.7841
va: 2.0809 2.0797 4.0224 2.0875 2.0751 4.0034 4.5630 4.5646 1.1682 1.1687 1.1809 1.1638 1.1759 1.1796 2.2294 0.9735 0.9718 3.3151
dispersion: -0.019591713 hartree
energy: -2637.953854586766 hartree
dipole: -3.531702643 2.623704529 -0.907998113 3.323345528 -1.912994439 1.410351089 3.996384837 -3.021462635 0.974922202
dipolemethod: SCF
magnitude: 1.940109293 au
magnitude: 4.931365921 debye
temp: 298.15 k
press: 1.00 atm
zeropoint: 0.07850373 hartree
thermalvibcorrection: 0.01517661 hartree
thermalrotcorrection: 0.00141627 hartree
thermaltrasncorrection: 0.00141627 hartree
thermaltotal: -2637.85734170 hartree
thermalcorr: 0.01800915 hartree
nonthermalcorr: 0.07850373 hartree
totalcorr: 0.09651288 hartree
thermalcorrenthalpy: 0.00094421 hartree
totalenthalpy: -2637.85639749 hartree
vibrat: 0.02856510 hartree
rotat: 0.01587003 hartree
transl: 0.02044007 hartree
total: 0.06591248 hartree
totalentropycorr: -0.06591248 hartree
gibbsenthalpy: -2637.92230997 hartree
gibbsminuselec: 0.03154461 hartree
