program: Orca
programVersion: 6.0.0
elementType: O O C O O C C C F F F F F F O H H Ni O H H C N C H H H
charge: 0
multiplicity: 3
keywords: b3lyp d3bj def2-TZVPP def2/J RIJCOSX TightSCF defgrid3 CPCM(Acetonitrile)
formula: C6H7F6NNiO6
InChI: InChI=1/2C2F3O2.C2H3N.Ni.2H2O/c2*3-2(4,5)1(6)7;1-2-3;;;/h;;1H3;;2*1H2/q2*-1;;+2;;/rC6H7F6NNiO6/c1-2-13-14(17,18,19-3(15)5(7,8)9)20-4(16)6(10,11)12/h17-18H2,1H3
27 atoms
O  1.041119 0.868236 7.816707
O  3.850701 6.713375 6.336388
C  2.664833 6.523642 6.011803
O  2.872175 2.177679 8.157856
O  1.93943 5.489551 6.142186
C  2.161808 1.131974 8.287085
C  2.855263 0.047476 9.167942
C  1.898607 7.703855 5.337632
F  3.991442 -0.39972 8.569112
F  2.066128 -1.024979 9.38778
F  3.208756 0.54827 10.379181
F  0.810833 8.05896 6.070196
F  2.665451 8.804896 5.192795
F  1.455102 7.35165 4.10241
O  0.494778 3.267172 6.933138
H  0.079495 3.373691 6.061897
H  0.498017 2.285754 7.151236
Ni 2.482641 3.713842 6.917923
O  4.368193 4.366668 7.365635
H  4.52963 4.364742 8.323409
H  4.345895 5.328302 7.068782
C  3.232591 2.28852 4.255969
N  2.962592 2.831058 5.238508
C  3.57167 1.606641 3.024221
H  3.954137 2.332325 2.301429
H  4.337258 0.852741 3.226863
H  2.678509 1.122451 2.620141
elementType: O C F H Ni N
totalener: -2846.48806920478137 hartree
nucrepener: 2232.36145600378359 hartree
electener: -5078.81063449903650 hartree
oneelecener: -8393.37624778477038 hartree
twoeener: 3314.56561328573389 hartree
cpcmener: -0.03889175230100 hartree
kineticenergy: 2839.06387428616199 hartree
exchangeener: -168.734959191721 hartree
correlationener: -8.042044972450 hartree
xcener: -176.777004164170 hartree
s2: 2.003832
energy: -8161.0970 -975.7493 -851.1844 -851.0955 -851.0893 -672.7494 -672.7464 -672.7409 -672.7382 -672.7373 -672.7359 -521.2829 -521.2245 -520.8159 -520.8131 -520.5652 -520.5651 -390.7586 -283.8758 -283.8716 -280.8317 -280.8314 -279.2791 -278.0138 -112.4164 -74.1573 -73.9947 -73.9794 -35.8723 -35.8690 -33.5798 -33.5762 -33.5381 -33.5356 -29.7329 -29.7014 -28.1762 -28.1223 -27.4558 -27.3970 -25.9906 -21.3347 -20.2377 -20.2276 -17.4478 -17.4289 -16.3901 -16.3863 -16.3743 -16.3599 -15.3599 -15.1974 -14.8364 -14.6442 -14.3786 -13.5700 -13.4118 -13.2360 -13.1548 -13.1457 -13.0642 -13.0071 -12.9344 -12.7411 -12.7174 -12.5144 -12.5056 -12.1213 -12.1058 -12.0606 -12.0330 -11.9575 -11.7825 -11.6949 -11.5300 -11.5265 -11.2074 -10.6372 -10.5315 -10.1393 -10.1198 -9.8381 -9.6845 -9.3029 -9.0347 -8.7701 -8.5345 -8.4171 -8.2768 -8.2055 -7.5955 -0.6504 -0.6157 -0.1691 -0.0987 0.2719 1.0598 1.4345 2.4463 2.6018 2.6527 3.1265 electronvolt
energy: -8161.0721 -974.4967 -850.1452 -850.0678 -850.0614 -672.7482 -672.7451 -672.7412 -672.7379 -672.7375 -672.7357 -521.2294 -521.1769 -520.7662 -520.7645 -520.5652 -520.5645 -390.7014 -283.8724 -283.8680 -280.8326 -280.8321 -279.2786 -278.0123 -109.7293 -71.3180 -71.1557 -71.1396 -35.8709 -35.8676 -33.5781 -33.5743 -33.5378 -33.5356 -29.6921 -29.6631 -28.0703 -28.0299 -27.4034 -27.3441 -25.9286 -21.3278 -20.2194 -20.2118 -17.4149 -17.4094 -16.3885 -16.3851 -16.3665 -16.3554 -15.2897 -15.1653 -14.7017 -14.4099 -14.3246 -13.4794 -13.2076 -13.1511 -13.1459 -13.0676 -12.9854 -12.8459 -12.7257 -12.7178 -12.4934 -12.4499 -12.1785 -12.0989 -12.0795 -12.0522 -11.8296 -11.7445 -11.7236 -11.6325 -11.5284 -11.5242 -10.5999 -10.3249 -10.0036 -9.7462 -9.2543 -9.2024 -8.7906 -8.6504 -8.6039 -8.4602 -8.2090 -8.0916 -8.0198 -2.6136 -1.8542 -0.5894 -0.5642 -0.1218 -0.0564 0.3575 1.1020 1.4520 2.4524 2.6612 electronvolt
chargesum: -0.0000000
charge: -0.448185 -0.442545 0.277931 -0.477418 -0.470280 0.297902 0.509974 0.512105 -0.186904 -0.179576 -0.184803 -0.186017 -0.179718 -0.186398 -0.411214 0.255100 0.252589 0.832744 -0.425766 0.256904 0.257647 0.020572 -0.021657 -0.119323 0.148769 0.148793 0.148774
charge: 0.079030 0.081767 -0.520851 0.116881 0.118913 -0.521517 -0.597129 -0.596890 0.169473 0.184503 0.172758 0.171095 0.184364 0.170641 0.399592 -0.067971 -0.143701 -0.003308 0.394946 -0.069829 -0.148390 -0.014183 0.212094 0.049625 0.059347 0.059410 0.059329
qa: -0.4482 -0.4425 0.2779 -0.4774 -0.4703 0.2979 0.5100 0.5121 -0.1869 -0.1796 -0.1848 -0.1860 -0.1797 -0.1864 -0.4112 0.2551 0.2526 0.8327 -0.4258 0.2569 0.2576 0.0206 -0.0217 -0.1193 0.1488 0.1488 0.1488
va: 2.0415 2.0418 4.2731 1.9810 1.9812 4.2396 4.4439 4.4354 1.1055 1.1250 1.1096 1.1074 1.1249 1.1068 2.1116 0.9978 1.0626 3.4893 2.0973 0.9964 1.0632 3.6880 3.1555 3.8354 0.9874 0.9875 0.9876
dispersion: -0.044316962 hartree
energy: -2846.532386167266 hartree
dipole: 3.536171488 -2.942461930 0.593709558 -7.015773958 5.493221922 -1.522552036 -13.123774166 10.201901730 -2.921872436
dipolemethod: SCF
magnitude: 3.347834267 au
magnitude: 8.509518443 debye
