program: Orca
programVersion: 6.0.0
elementType: O O C O O C C C F F F F F F O H H Ni O H H C N C H H H
charge: 0
multiplicity: 3
keywords: TPSS D3BJ TightOpt Freq def2-TZVPP def2/J RIJCOSX TightSCF defgrid3 CPCM(Acetonitrile)
frequency: 0.00 0.00 0.00 0.00 0.00 0.00 13.02 13.81 15.30 19.62 30.60 36.15 40.15 50.19 63.61 71.53 92.43 109.60 139.66 144.14 157.90 161.50 184.87 225.59 229.42 242.46 259.12 263.32 290.23 294.08 317.42 334.32 374.20 399.73 400.91 422.36 424.55 430.89 449.75 467.43 476.68 494.01 494.71 585.62 588.17 636.04 649.56 693.60 696.25 765.92 766.92 801.91 807.95 945.34 946.36 981.03 1036.09 1038.44 1052.08 1052.90 1098.23 1098.65 1148.72 1153.04 1379.95 1383.54 1384.64 1433.55 1434.08 1571.34 1578.43 1632.82 1642.00 2328.76 3014.91 3020.35 3042.78 3098.80 3099.05 3721.40 3724.30
frequency: 13.02 13.81 15.30 19.62 30.60 36.15 40.15 50.19 63.61 71.53 92.43 109.60 139.66 144.14 157.90 161.50 184.87 225.59 229.42 242.46 259.12 263.32 290.23 294.08 317.42 334.32 374.20 399.73 400.91 422.36 424.55 430.89 449.75 467.43 476.68 494.01 494.71 585.62 588.17 636.04 649.56 693.60 696.25 765.92 766.92 801.91 807.95 945.34 946.36 981.03 1036.09 1038.44 1052.08 1052.90 1098.23 1098.65 1148.72 1153.04 1379.95 1383.54 1384.64 1433.55 1434.08 1571.34 1578.43 1632.82 1642.00 2328.76 3014.91 3020.35 3042.78 3098.80 3099.05 3721.40 3724.30
formula: C6H7F6NNiO6
InChI: InChI=1/2C2F3O2.C2H3N.Ni.2H2O/c2*3-2(4,5)1(6)7;1-2-3;;;/h;;1H3;;2*1H2/q2*-1;;+2;;/rC6H7F6NNiO6/c1-2-13-14(17,18,19-3(15)5(7,8)9)20-4(16)6(10,11)12/h17-18H2,1H3
27 atoms
O  1.041119 0.868236 7.816707
O  3.850701 6.713375 6.336388
C  2.664833 6.523642 6.011803
O  2.872175 2.177679 8.157856
O  1.93943 5.489551 6.142186
C  2.161808 1.131974 8.287085
C  2.855263 0.047476 9.167942
C  1.898607 7.703855 5.337632
F  3.991442 -0.39972 8.569112
F  2.066128 -1.024979 9.38778
F  3.208756 0.54827 10.379181
F  0.810833 8.05896 6.070196
F  2.665451 8.804896 5.192795
F  1.455102 7.35165 4.10241
O  0.494778 3.267172 6.933138
H  0.079495 3.373691 6.061897
H  0.498017 2.285754 7.151236
Ni 2.482641 3.713842 6.917923
O  4.368193 4.366668 7.365635
H  4.52963 4.364742 8.323409
H  4.345895 5.328302 7.068782
C  3.232591 2.28852 4.255969
N  2.962592 2.831058 5.238508
C  3.57167 1.606641 3.024221
H  3.954137 2.332325 2.301429
H  4.337258 0.852741 3.226863
H  2.678509 1.122451 2.620141
totalener: -2847.28567008598611 hartree
nucrepener: 2217.09281863421938 hartree
electener: -5064.33910461117739 hartree
oneelecener: -8362.78152584554118 hartree
twoeener: 3298.44242123436334 hartree
cpcmener: -0.03938410902678 hartree
kineticenergy: 2839.70314406166653 hartree
exchangeener: -213.299678654205 hartree
correlationener: -6.542760604351 hartree
xcener: -219.842439258555 hartree
s2: 2.002688
dispersion: -0.033312697 hartree
s2: 2.002745
dispersion: -0.033174679 hartree
s2: 2.002888
dispersion: -0.033063924 hartree
s2: 2.003005
dispersion: -0.033025786 hartree
s2: 2.003069
dispersion: -0.032973017 hartree
s2: 2.003140
dispersion: -0.032782871 hartree
s2: 2.003102
dispersion: -0.032997716 hartree
s2: 2.003115
dispersion: -0.032985340 hartree
s2: 2.003141
dispersion: -0.032925206 hartree
s2: 2.003162
dispersion: -0.032887252 hartree
dispersion: -0.032932106 hartree
s2: 2.003161
dispersion: -0.032967955 hartree
s2: 2.003157
dispersion: -0.032989416 hartree
s2: 2.003155
dispersion: -0.032993220 hartree
s2: 2.003152
dispersion: -0.032991437 hartree
s2: 2.003151
dispersion: -0.032984197 hartree
s2: 2.003150
dispersion: -0.032977585 hartree
dispersion: -0.032974099 hartree
dispersion: -0.032974951 hartree
dispersion: -0.032976880 hartree
dispersion: -0.032979340 hartree
dispersion: -0.032980886 hartree
dispersion: -0.032981714 hartree
elementType: O C F H Ni N
energy: -8136.5924 -964.3083 -840.1943 -840.0699 -840.0561 -665.2540 -665.2507 -665.2378 -665.2348 -665.2330 -665.2325 -514.7863 -514.7022 -514.3073 -514.2988 -513.9529 -513.9486 -384.9059 -278.5136 -278.5091 -275.4933 -275.4894 -273.9836 -273.0517 -107.9780 -70.2232 -69.9941 -69.9691 -33.6037 -33.5999 -31.3932 -31.3892 -31.3486 -31.3456 -27.7853 -27.7526 -26.4313 -26.3579 -25.5891 -25.5393 -24.1737 -19.8486 -18.5544 -18.5445 -15.8232 -15.8109 -14.7699 -14.7654 -14.7541 -14.7377 -14.0023 -13.8559 -13.5145 -13.1428 -12.9313 -12.1660 -11.9097 -11.7787 -11.6249 -11.6146 -11.4878 -11.4871 -11.3653 -11.3474 -11.1780 -11.0894 -11.0727 -10.6109 -10.5614 -10.5272 -10.3843 -10.3814 -10.2019 -10.1701 -9.8453 -9.8420 -9.6277 -9.2882 -8.9545 -8.7355 -8.6357 -8.0475 -7.7989 -7.5928 -7.4519 -7.2380 -7.0435 -6.9492 -6.8898 -6.8201 -5.9174 -1.4046 -1.3643 -0.8982 -0.8483 -0.0838 0.7607 1.0783 2.0873 2.1436 2.3217 2.4927 electronvolt
energy: -8136.5775 -963.3918 -839.4304 -839.3306 -839.3189 -665.2522 -665.2487 -665.2381 -665.2343 -665.2333 -665.2322 -514.7253 -514.6504 -514.2505 -514.2435 -513.9510 -513.9475 -384.8482 -278.5089 -278.5039 -275.4943 -275.4903 -273.9836 -273.0495 -105.8124 -68.0569 -67.8469 -67.8327 -33.6018 -33.5980 -31.3910 -31.3868 -31.3481 -31.3453 -27.7427 -27.7128 -26.3287 -26.2721 -25.5369 -25.4871 -24.1197 -19.8408 -18.5360 -18.5273 -15.7990 -15.7930 -14.7674 -14.7631 -14.7466 -14.7327 -13.9576 -13.8251 -13.4175 -13.0410 -12.8899 -12.1006 -11.7569 -11.6381 -11.6142 -11.5834 -11.4814 -11.4489 -11.3528 -11.3403 -11.0736 -11.0345 -10.7461 -10.5608 -10.4997 -10.4297 -10.3742 -10.3349 -10.1894 -10.1563 -9.8443 -9.8410 -9.3469 -9.2001 -8.7847 -8.4706 -7.9440 -7.8115 -7.6295 -7.4523 -7.2121 -6.9618 -6.5063 -6.3430 -6.2770 -4.1466 -3.3571 -1.3577 -1.3361 -0.8462 -0.8005 0.0368 0.8077 1.1054 2.1512 2.2135 electronvolt
chargesum: 0.0000000
charge: -0.420840 -0.414026 0.268065 -0.441612 -0.434311 0.292453 0.413175 0.416255 -0.158108 -0.150992 -0.156161 -0.157348 -0.151172 -0.157663 -0.405747 0.268021 0.251212 0.713087 -0.423422 0.268224 0.256090 -0.115675 0.104743 -0.015991 0.117214 0.117296 0.117234
charge: 0.095417 0.097985 -0.538794 0.138854 0.140309 -0.539150 -0.626182 -0.625925 0.179606 0.194580 0.182748 0.181105 0.194432 0.180717 0.413310 -0.066260 -0.146164 -0.057642 0.406536 -0.068872 -0.151131 -0.026736 0.216276 0.055267 0.056545 0.056627 0.056541
qa: -0.4208 -0.4140 0.2681 -0.4416 -0.4343 0.2925 0.4132 0.4163 -0.1581 -0.1510 -0.1562 -0.1573 -0.1512 -0.1577 -0.4057 0.2680 0.2512 0.7131 -0.4234 0.2682 0.2561 -0.1157 0.1047 -0.0160 0.1172 0.1173 0.1172
va: 2.0847 2.0859 4.2721 2.0424 2.0435 4.2342 4.5323 4.5235 1.1443 1.1649 1.1483 1.1461 1.1648 1.1456 2.1242 0.9856 1.0658 3.5665 2.1062 0.9855 1.0672 3.7944 3.1189 3.9138 1.0035 1.0036 1.0037
dispersion: -0.032980553 hartree
energy: -2847.325886823442 hartree
dipole: 3.536171392 -2.977366607 0.558804786 -7.015774324 5.534246696 -1.481527629 -13.123771886 10.297957387 -2.825814498
dipolemethod: SCF
magnitude: 3.239199667 au
magnitude: 8.233391235 debye
temp: 298.15 k
press: 1.00 atm
zeropoint: 0.14960450 hartree
thermalvibcorrection: 0.02198650 hartree
thermalrotcorrection: 0.00141627 hartree
thermaltrasncorrection: 0.00141627 hartree
thermaltotal: -2847.15146328 hartree
thermalcorr: 0.02481904 hartree
nonthermalcorr: 0.14960450 hartree
totalcorr: 0.17442354 hartree
thermalcorrenthalpy: 0.00094421 hartree
totalenthalpy: -2847.15051908 hartree
vibrat: 0.04181625 hartree
rotat: 0.01660433 hartree
transl: 0.02069250 hartree
total: 0.08015037 hartree
totalentropycorr: -0.08015037 hartree
gibbsenthalpy: -2847.23066945 hartree
gibbsminuselec: 0.09521738 hartree
