program: Orca
programVersion: 6.0.0
elementType: O O C O O C C C F F F F F F O H H O H H Ni
charge: 0
multiplicity: 3
keywords: b3lyp d3bj def2-TZVPP def2/J RIJCOSX TightSCF defgrid3 CPCM(Acetonitrile)
formula: C4H4F6NiO6
InChI: InChI=1/2C2F3O2.Ni.2H2O/c2*3-2(4,5)1(6)7;;;/h;;;2*1H2/q-2;-1;+3;;/rC4H4F6NiO6/c5-3(6,7)1(12)15-11(13,14)16-2(17-11)4(8,9)10/h13-14H2
21 atoms
O  2.4502 2.286268 8.056628
O  3.052148 5.975364 6.40715
C  1.91652 5.749011 5.907342
O  1.549144 2.731918 10.099092
O  1.266512 4.690527 6.145261
C  1.934625 1.988227 9.18158
C  1.784386 0.448266 9.37583
C  1.304645 6.821734 4.976734
F  2.980222 -0.180145 9.242182
F  0.946604 -0.073777 8.442166
F  1.290329 0.127699 10.58909
F  1.061445 7.960612 5.670765
F  2.160986 7.127512 3.973598
F  0.144803 6.417082 4.424619
O  4.051796 3.227853 6.054677
H  3.801737 2.303596 5.88378
H  4.132325 3.650401 5.182966
O  2.074538 5.050943 9.017931
H  2.742176 5.586356 9.478233
H  1.846599 4.274882 9.619396
Ni 2.809888 4.118564 7.388563
elementType: O C F H Ni
totalener: -2713.72615398561493 hartree
nucrepener: 1832.02155630179800 hartree
electener: -4545.71099116444748 hartree
oneelecener: -7414.22625956766205 hartree
twoeener: 2868.51526840321412 hartree
cpcmener: -0.03671687254458 hartree
kineticenergy: 2706.92280468443460 hartree
exchangeener: -154.423965389048 hartree
correlationener: -7.175547291748 hartree
xcener: -161.599512680796 hartree
s2: 2.003308
energy: -8161.2412 -975.8291 -851.2988 -851.1682 -851.1522 -672.9639 -672.9530 -672.9517 -672.7970 -672.7867 -672.7845 -522.0298 -521.4550 -521.2004 -521.0834 -521.0232 -520.7024 -284.2186 -283.9507 -281.1336 -280.9755 -112.5220 -74.3627 -74.1013 -74.0016 -36.1212 -35.9265 -33.8205 -33.7768 -33.6323 -33.5883 -30.3312 -29.8733 -28.9324 -28.3216 -27.6306 -27.5827 -20.6204 -20.3166 -17.7106 -17.5287 -16.6311 -16.6077 -16.4412 -16.4275 -15.8114 -15.3653 -14.7449 -14.5664 -13.7800 -13.6114 -13.3841 -13.3597 -13.2025 -13.1900 -13.0988 -12.9432 -12.7448 -12.5985 -12.4091 -12.2532 -12.1888 -12.1070 -12.0646 -11.8240 -11.7266 -11.5722 -11.2645 -11.0712 -10.5109 -10.3219 -10.1365 -10.0387 -9.5704 -9.0207 -8.8149 -8.7741 -8.4241 -8.3468 -7.8138 -1.0455 -0.7567 -0.1301 1.0025 2.1992 2.2377 2.6330 2.7918 3.0154 3.3277 3.5509 electronvolt
energy: -8161.2170 -974.5926 -850.2428 -850.1708 -850.1513 -672.9630 -672.9524 -672.9512 -672.7957 -672.7869 -672.7844 -521.9868 -521.4111 -521.1269 -521.0322 -520.9726 -520.7028 -284.2165 -283.9469 -281.1395 -280.9767 -109.8622 -71.4439 -71.2995 -71.2886 -36.1195 -35.9250 -33.8186 -33.7756 -33.6304 -33.5882 -30.2275 -29.8322 -28.8489 -28.2344 -27.5296 -27.4979 -20.5979 -20.2980 -17.6834 -17.5005 -16.6301 -16.6005 -16.4399 -16.4200 -15.7723 -15.3245 -14.6255 -14.4875 -13.5315 -13.4173 -13.3611 -13.2000 -13.1349 -13.0905 -12.9005 -12.8292 -12.5837 -12.5509 -12.2489 -12.2388 -12.1420 -12.0930 -11.8375 -11.7518 -11.7198 -11.5709 -10.5960 -10.1928 -9.6050 -9.3266 -9.2546 -9.0619 -8.8844 -8.7665 -8.4023 -8.3821 -8.2530 -2.9002 -2.0715 -1.0263 -0.7190 0.0044 1.0350 2.2126 2.3471 2.7353 2.8274 3.0637 electronvolt
chargesum: -0.0000000
charge: -0.493128 -0.450836 0.354018 -0.432148 -0.449288 0.282213 0.509820 0.506415 -0.183534 -0.184377 -0.177488 -0.176736 -0.175630 -0.170734 -0.358768 0.275284 0.272409 -0.406976 0.263515 0.259450 0.936517
charge: 0.117127 0.110659 -0.510925 0.092151 0.122699 -0.510865 -0.597811 -0.601557 0.174119 0.172748 0.187443 0.183870 0.185809 0.196177 0.446610 -0.046065 -0.045297 0.403902 -0.061883 -0.142965 0.124053
qa: -0.4931 -0.4508 0.3540 -0.4321 -0.4493 0.2822 0.5098 0.5064 -0.1835 -0.1844 -0.1775 -0.1767 -0.1756 -0.1707 -0.3588 0.2753 0.2724 -0.4070 0.2635 0.2594 0.9365
va: 1.9640 2.0235 4.0355 2.0586 2.0109 4.2785 4.4407 4.4756 1.1114 1.1100 1.1287 1.1240 1.1264 1.1379 2.2005 0.9832 0.9843 2.1442 0.9926 1.0619 3.2710
dispersion: -0.032792815 hartree
energy: -2713.758946800433 hartree
dipole: 5.597732056 -3.242591140 2.355140917 1.227763869 -1.026404983 0.201358886 2.234982814 -3.084463428 -0.849480614
dipolemethod: SCF
magnitude: 2.511742712 au
magnitude: 6.384342602 debye
