program: Orca
programVersion: 6.0.0
elementType: O O C O O C C C F F F F F F O H H O H H Ni
charge: 0
multiplicity: 3
keywords: TPSS D3BJ TightOpt Freq def2-TZVPP def2/J RIJCOSX TightSCF defgrid3 CPCM(Acetonitrile)
frequency: 0.00 0.00 0.00 0.00 0.00 0.00 9.62 14.87 18.45 31.58 41.04 47.68 75.97 87.54 105.99 146.62 162.35 170.45 228.83 231.52 247.28 252.32 264.82 294.24 321.84 340.95 404.19 428.56 431.36 433.94 467.24 478.29 493.50 494.07 495.29 589.78 596.23 648.46 670.17 695.98 698.49 766.23 767.30 806.89 812.74 961.69 974.46 1056.77 1057.18 1102.94 1103.30 1147.57 1152.32 1383.66 1388.27 1557.29 1561.45 1636.48 1643.74 2976.45 2989.24 3719.27 3719.91
frequency: 9.62 14.87 18.45 31.58 41.04 47.68 75.97 87.54 105.99 146.62 162.35 170.45 228.83 231.52 247.28 252.32 264.82 294.24 321.84 340.95 404.19 428.56 431.36 433.94 467.24 478.29 493.50 494.07 495.29 589.78 596.23 648.46 670.17 695.98 698.49 766.23 767.30 806.89 812.74 961.69 974.46 1056.77 1057.18 1102.94 1103.30 1147.57 1152.32 1383.66 1388.27 1557.29 1561.45 1636.48 1643.74 2976.45 2989.24 3719.27 3719.91
formula: C4H4F6NiO6
InChI: InChI=1/2C2F3O2.Ni.2H2O/c2*3-2(4,5)1(6)7;;;/h;;;2*1H2/q2*-1;+2;;/rC4H4F6NiO6/c5-3(6,7)1(12)16-11(14,15)17-2(13)4(8,9)10/h14-15H2
21 atoms
O  1.102809 0.816496 7.844962
O  3.804282 6.709748 6.509822
C  2.696516 6.436443 6.020536
O  2.875941 2.175672 8.285415
O  2.01249 5.363853 6.102247
C  2.197735 1.102036 8.36112
C  2.835026 -0.006387 9.25416
C  1.97869 7.529053 5.170529
F  2.865571 -1.192808 8.599764
F  2.090734 -0.182134 10.37791
F  4.095386 0.277472 9.642702
F  0.787293 7.866566 5.727753
F  2.710233 8.656175 5.0604
F  1.726341 7.079451 3.9150
O  0.570492 3.16074 6.877537
H  0.257642 3.255852 5.962775
H  0.5801 2.179767 7.113534
O  4.325424 4.360723 7.48152
H  4.643719 4.265698 8.394398
H  4.323678 5.340179 7.241957
Ni 2.445382 3.765823 7.185372
totalener: -2714.41956455067975 hartree
nucrepener: 1761.73494697833644 hartree
electener: -4476.12046282972915 hartree
oneelecener: -7272.32366500518583 hartree
twoeener: 2796.20320217545623 hartree
cpcmener: -0.03404869928621 hartree
kineticenergy: 2707.51079360723816 hartree
exchangeener: -195.151035698227 hartree
correlationener: -5.825491787247 hartree
xcener: -200.976527485474 hartree
s2: 2.001926
dispersion: -0.023983642 hartree
s2: 2.001935
dispersion: -0.024008917 hartree
s2: 2.002276
dispersion: -0.024851537 hartree
s2: 2.002138
dispersion: -0.024602607 hartree
s2: 2.002068
dispersion: -0.024457702 hartree
s2: 2.002007
dispersion: -0.024276784 hartree
s2: 2.001987
dispersion: -0.024175078 hartree
s2: 2.001970
dispersion: -0.024117179 hartree
s2: 2.001976
dispersion: -0.024119722 hartree
s2: 2.001977
dispersion: -0.024118486 hartree
s2: 2.001979
dispersion: -0.024120437 hartree
s2: 2.001974
dispersion: -0.024101470 hartree
dispersion: -0.024101706 hartree
s2: 2.001975
dispersion: -0.024108441 hartree
dispersion: -0.024118515 hartree
s2: 2.001980
dispersion: -0.024128306 hartree
s2: 2.001996
dispersion: -0.024186121 hartree
s2: 2.001957
dispersion: -0.024223491 hartree
dispersion: -0.024111789 hartree
s2: 2.001973
dispersion: -0.024191712 hartree
s2: 2.001988
dispersion: -0.024144723 hartree
s2: 2.001972
dispersion: -0.024150153 hartree
dispersion: -0.024118645 hartree
dispersion: -0.024146180 hartree
dispersion: -0.024128179 hartree
dispersion: -0.024124419 hartree
dispersion: -0.024122652 hartree
dispersion: -0.024100195 hartree
dispersion: -0.024156448 hartree
s2: 2.002002
dispersion: -0.024193173 hartree
s2: 2.001978
dispersion: -0.024107443 hartree
dispersion: -0.024116959 hartree
dispersion: -0.024114146 hartree
dispersion: -0.024113409 hartree
dispersion: -0.024116516 hartree
dispersion: -0.024116347 hartree
dispersion: -0.024116324 hartree
dispersion: -0.024114050 hartree
dispersion: -0.024112780 hartree
dispersion: -0.024110609 hartree
dispersion: -0.024109623 hartree
dispersion: -0.024110216 hartree
dispersion: -0.024112946 hartree
dispersion: -0.024114325 hartree
dispersion: -0.024115352 hartree
dispersion: -0.024115010 hartree
dispersion: -0.024114871 hartree
elementType: O C F H Ni
energy: -8137.2068 -964.8841 -840.8530 -840.6525 -840.5438 -665.3209 -665.3119 -665.3023 -665.3003 -665.2996 -665.2979 -515.0623 -515.0543 -514.5885 -514.5553 -514.1368 -514.0958 -278.6134 -278.6130 -275.6788 -275.6784 -108.5898 -70.9961 -70.6137 -70.4227 -33.6812 -33.6785 -31.4678 -31.4614 -31.4209 -31.4205 -27.9969 -27.9575 -26.6786 -26.6693 -25.7959 -25.7399 -18.6678 -18.6564 -15.9518 -15.9340 -14.8529 -14.8422 -14.8401 -14.8176 -14.3208 -14.1507 -13.4632 -13.1565 -12.4389 -12.0008 -11.6874 -11.5946 -11.5720 -11.4238 -11.3800 -11.2230 -11.2078 -10.9022 -10.6752 -10.6537 -10.4578 -10.4517 -10.2891 -10.2605 -9.9048 -9.9019 -9.8748 -9.2541 -8.8887 -8.6458 -8.5015 -7.8895 -7.8583 -7.8479 -7.7946 -7.3088 -7.1451 -7.0710 -6.0915 -1.6355 -1.4893 -0.5521 0.8516 1.2606 1.9378 2.1383 2.2612 2.3900 2.5395 3.0446 electronvolt
energy: -8137.1916 -963.9701 -840.0635 -839.9116 -839.8414 -665.3188 -665.3121 -665.3008 -665.3004 -665.2995 -665.2971 -515.0069 -514.9991 -514.5335 -514.5006 -514.1373 -514.0962 -278.6084 -278.6082 -275.6802 -275.6798 -106.4081 -68.7780 -68.4050 -68.3390 -33.6792 -33.6766 -31.4653 -31.4604 -31.4208 -31.4186 -27.9556 -27.9191 -26.5841 -26.5761 -25.7462 -25.6905 -18.6475 -18.6398 -15.9226 -15.9170 -14.8427 -14.8391 -14.8366 -14.8127 -14.2720 -14.1213 -13.3512 -13.1162 -12.3144 -11.9569 -11.5860 -11.5691 -11.4276 -11.4062 -11.2066 -11.1961 -11.1269 -10.8146 -10.6496 -10.5995 -10.4510 -10.4470 -10.2762 -10.2542 -9.9035 -9.9011 -9.2707 -8.7393 -8.2941 -8.2366 -7.8248 -7.6602 -7.4783 -7.1331 -7.1220 -6.8509 -6.6601 -5.4905 -3.5999 -1.6108 -1.4707 -0.2823 0.8860 1.6209 2.0686 2.1741 2.2842 2.4116 electronvolt
chargesum: 0.0000000
charge: -0.411401 -0.399056 0.286003 -0.407296 -0.416678 0.286644 0.423585 0.422968 -0.153559 -0.156010 -0.150149 -0.154690 -0.148245 -0.154502 -0.395060 0.282772 0.258199 -0.395223 0.283232 0.258938 0.839528
charge: 0.107783 0.111351 -0.526570 0.136944 0.133178 -0.526956 -0.627053 -0.627835 0.188407 0.183215 0.196061 0.184474 0.198722 0.185196 0.418117 -0.058931 -0.145606 0.418958 -0.058708 -0.144749 0.254001
qa: -0.4114 -0.3991 0.2860 -0.4073 -0.4167 0.2866 0.4236 0.4230 -0.1536 -0.1560 -0.1501 -0.1547 -0.1482 -0.1545 -0.3951 0.2828 0.2582 -0.3952 0.2832 0.2589 0.8395
va: 2.1034 2.1077 4.2366 2.0842 2.0827 4.2360 4.5202 4.5248 1.1538 1.1488 1.1652 1.1505 1.1701 1.1509 2.1643 0.9755 1.0648 2.1660 0.9752 1.0637 3.3649
dispersion: -0.024114621 hartree
energy: -2714.446246981461 hartree
dipole: 0.283627397 -0.157002578 0.126624820 0.038236816 0.023162054 0.061398870 -0.162580321 0.142580864 -0.019999457
dipolemethod: SCF
magnitude: 0.142139524 au
magnitude: 0.361289959 debye
temp: 298.15 k
press: 1.00 atm
zeropoint: 0.10343947 hartree
thermalvibcorrection: 0.01683603 hartree
thermalrotcorrection: 0.00141627 hartree
thermaltrasncorrection: 0.00141627 hartree
thermaltotal: -2714.32313894 hartree
thermalcorr: 0.01966858 hartree
nonthermalcorr: 0.10343947 hartree
totalcorr: 0.12310804 hartree
thermalcorrenthalpy: 0.00094421 hartree
totalenthalpy: -2714.32219473 hartree
vibrat: 0.03176391 hartree
rotat: 0.01616831 hartree
transl: 0.02052193 hartree
total: 0.06949144 hartree
totalentropycorr: -0.06949144 hartree
gibbsenthalpy: -2714.39168617 hartree
gibbsminuselec: 0.05456082 hartree
