program: Orca
programVersion: 6.0.0
elementType: O O C O O C C C F F F F F F O H H O H H Ni
charge: 0
multiplicity: 3
keywords: TPSS D3BJ TightOpt Freq def2-TZVPP def2/J RIJCOSX TightSCF defgrid3 CPCM(Acetonitrile)
frequency: 0.00 0.00 0.00 0.00 0.00 0.00 8.69 11.34 20.05 33.84 42.91 50.42 64.46 97.82 106.85 117.09 127.82 134.82 162.29 181.45 224.95 242.71 260.93 276.42 280.51 313.14 368.07 379.50 417.50 429.61 443.73 449.51 483.67 494.48 495.29 546.63 570.52 591.58 631.29 653.53 696.11 704.48 767.46 768.77 807.43 836.42 963.77 1055.25 1065.48 1101.08 1107.17 1149.14 1157.83 1388.30 1444.12 1563.10 1564.52 1605.67 1634.90 2982.74 3660.15 3719.21 3735.20
frequency: 8.69 11.34 20.05 33.84 42.91 50.42 64.46 97.82 106.85 117.09 127.82 134.82 162.29 181.45 224.95 242.71 260.93 276.42 280.51 313.14 368.07 379.50 417.50 429.61 443.73 449.51 483.67 494.48 495.29 546.63 570.52 591.58 631.29 653.53 696.11 704.48 767.46 768.77 807.43 836.42 963.77 1055.25 1065.48 1101.08 1107.17 1149.14 1157.83 1388.30 1444.12 1563.10 1564.52 1605.67 1634.90 2982.74 3660.15 3719.21 3735.20
formula: C4H4F6NiO6
InChI: InChI=1/2C2F3O2.Ni.2H2O/c2*3-2(4,5)1(6)7;;;/h;;;2*1H2/q-2;-1;+3;;/rC4H4F6NiO6/c5-3(6,7)1(12)15-11(13,14)16-2(17-11)4(8,9)10/h13-14H2
21 atoms
O  1.274528 0.927598 7.926137
O  3.806469 5.283156 7.360432
C  3.116322 6.100842 6.689516
O  2.911676 2.479685 8.233639
O  2.014238 5.786741 6.158047
C  2.332127 1.364316 8.417594
C  3.062401 0.400336 9.401845
C  3.630837 7.543997 6.483438
F  3.436198 -0.735175 8.755836
F  2.236242 0.035023 10.41452
F  4.170679 0.935569 9.954762
F  2.69048 8.446165 6.850182
F  4.74695 7.795118 7.194766
F  3.915729 7.75642 5.174252
O  0.498013 3.068484 6.669476
H  0.23083 2.990215 5.738784
H  0.61493 2.13609 7.036487
O  3.24925 3.149221 5.302289
H  3.082568 2.197049 5.187781
H  4.215888 3.229143 5.385767
Ni 2.313283 3.869727 6.958605
totalener: -2714.38419759418866 hartree
nucrepener: 1744.64279569463747 hartree
electener: -4458.98760952706198 hartree
oneelecener: -7238.48888802303009 hartree
twoeener: 2779.50127849596811 hartree
cpcmener: -0.03938376176369 hartree
kineticenergy: 2707.17166502116970 hartree
exchangeener: -195.068866970374 hartree
correlationener: -5.810466691597 hartree
xcener: -200.879333661971 hartree
s2: 2.002165
dispersion: -0.023822167 hartree
s2: 2.002142
dispersion: -0.024045801 hartree
s2: 2.002133
dispersion: -0.024317527 hartree
s2: 2.002144
dispersion: -0.024511123 hartree
s2: 2.002175
dispersion: -0.024791076 hartree
s2: 2.002248
dispersion: -0.025105559 hartree
s2: 2.002281
dispersion: -0.025082874 hartree
s2: 2.002279
dispersion: -0.024192225 hartree
s2: 2.002243
dispersion: -0.023841564 hartree
s2: 2.002221
dispersion: -0.024670460 hartree
s2: 2.002214
dispersion: -0.024674006 hartree
dispersion: -0.024342208 hartree
s2: 2.002194
dispersion: -0.024581631 hartree
s2: 2.002217
dispersion: -0.024551503 hartree
s2: 2.002203
dispersion: -0.024527831 hartree
s2: 2.002207
dispersion: -0.024519505 hartree
s2: 2.002213
dispersion: -0.024470147 hartree
dispersion: -0.024401449 hartree
s2: 2.002211
dispersion: -0.024355243 hartree
s2: 2.002206
dispersion: -0.024477378 hartree
s2: 2.002212
dispersion: -0.024321824 hartree
s2: 2.002208
dispersion: -0.024403523 hartree
dispersion: -0.024454063 hartree
dispersion: -0.024398633 hartree
dispersion: -0.024409303 hartree
dispersion: -0.024378474 hartree
dispersion: -0.024373610 hartree
dispersion: -0.024369140 hartree
dispersion: -0.024375597 hartree
dispersion: -0.024375904 hartree
dispersion: -0.024378686 hartree
dispersion: -0.024378221 hartree
dispersion: -0.024377522 hartree
s2: 2.002210
dispersion: -0.024352915 hartree
dispersion: -0.024375162 hartree
dispersion: -0.024378011 hartree
elementType: O C F H Ni
energy: -8136.5877 -964.2422 -840.1276 -840.0333 -839.9720 -665.4542 -665.4420 -665.4390 -665.2875 -665.2764 -665.2711 -515.5609 -514.9751 -514.5746 -514.5285 -514.5073 -514.0258 -278.8425 -278.5759 -275.7960 -275.6042 -107.9514 -70.1919 -70.0533 -69.8898 -33.8380 -33.6476 -31.6183 -31.5748 -31.4318 -31.3920 -28.3323 -27.8985 -27.2215 -26.5898 -25.7401 -25.6863 -18.9269 -18.6179 -16.0643 -15.8846 -14.9980 -14.9676 -14.8121 -14.7966 -14.4127 -14.0863 -13.2793 -12.9905 -12.1522 -12.0590 -11.9441 -11.6721 -11.5460 -11.5197 -11.4114 -11.3480 -11.1950 -11.1722 -11.0475 -10.6128 -10.5660 -10.4320 -10.4235 -10.2600 -10.0299 -9.8780 -9.6219 -9.3528 -8.9364 -8.3435 -8.1133 -7.8868 -7.7991 -7.4641 -7.3512 -7.1387 -6.9947 -6.8612 -6.0221 -1.8229 -1.4674 -0.4575 0.7496 1.1987 2.0630 2.1428 2.3579 2.5425 2.6092 3.1185 electronvolt
energy: -8136.5731 -963.3400 -839.3691 -839.2964 -839.2620 -665.4526 -665.4414 -665.4381 -665.2877 -665.2749 -665.2703 -515.4982 -514.9218 -514.5175 -514.4755 -514.4512 -514.0247 -278.8423 -278.5709 -275.7989 -275.6063 -105.8097 -68.0413 -67.8998 -67.8116 -33.8363 -33.6458 -31.6160 -31.5735 -31.4311 -31.3899 -28.2514 -27.8552 -27.1190 -26.4976 -25.6412 -25.6335 -18.9111 -18.6010 -16.0460 -15.8652 -14.9970 -14.9623 -14.8093 -14.7906 -14.3736 -14.0512 -13.2147 -12.9404 -12.0810 -11.9184 -11.8084 -11.5709 -11.5374 -11.4938 -11.3864 -11.2892 -11.1539 -10.9871 -10.8816 -10.5800 -10.5536 -10.4212 -10.4127 -10.2473 -10.0284 -9.8773 -9.2387 -8.9464 -8.2621 -7.9782 -7.9179 -7.7677 -7.5672 -7.2297 -6.6576 -6.3500 -6.3201 -4.2986 -3.5254 -1.7877 -1.4416 -0.3333 0.8824 1.2746 2.0863 2.1873 2.3765 2.5765 electronvolt
chargesum: -0.0000000
charge: -0.422025 -0.405229 0.344922 -0.427658 -0.405168 0.288863 0.420404 0.400157 -0.156710 -0.155188 -0.150591 -0.146436 -0.142630 -0.148673 -0.419550 0.277115 0.255554 -0.364161 0.280961 0.282280 0.793764
charge: 0.102499 0.135505 -0.529294 0.145421 0.131975 -0.531448 -0.626496 -0.629967 0.182808 0.185255 0.195394 0.196287 0.205394 0.192700 0.414697 -0.060351 -0.145478 0.457927 -0.041784 -0.041185 0.060141
qa: -0.4220 -0.4052 0.3449 -0.4277 -0.4052 0.2889 0.4204 0.4002 -0.1567 -0.1552 -0.1506 -0.1464 -0.1426 -0.1487 -0.4196 0.2771 0.2556 -0.3642 0.2810 0.2823 0.7938
va: 2.0941 2.0654 4.0264 2.0487 2.0767 4.2366 4.5212 4.5529 1.1474 1.1513 1.1645 1.1660 1.1769 1.1614 2.1298 0.9806 1.0656 2.1866 0.9730 0.9760 3.3647
dispersion: -0.024376896 hartree
energy: -2714.456257891653 hartree
dipole: -5.578226900 5.441804366 -0.136422533 -5.953041278 5.025477291 -0.927563987 -8.253112468 5.796681958 -2.456430510
dipolemethod: SCF
magnitude: 2.629265469 au
magnitude: 6.683061712 debye
temp: 298.15 k
press: 1.00 atm
zeropoint: 0.10295427 hartree
thermalvibcorrection: 0.01766475 hartree
thermalrotcorrection: 0.00141627 hartree
thermaltrasncorrection: 0.00141627 hartree
thermaltotal: -2714.33280634 hartree
thermalcorr: 0.02049729 hartree
nonthermalcorr: 0.10295427 hartree
totalcorr: 0.12345155 hartree
thermalcorrenthalpy: 0.00094421 hartree
totalenthalpy: -2714.33186213 hartree
vibrat: 0.03369964 hartree
rotat: 0.01615376 hartree
transl: 0.02052193 hartree
total: 0.07141263 hartree
totalentropycorr: -0.07141263 hartree
gibbsenthalpy: -2714.40327475 hartree
gibbsminuselec: 0.05298314 hartree
