program: Orca
programVersion: 6.0.0
elementType: O O C O O C C C F F F F F F O H H O H H Ni
charge: 0
multiplicity: 3
keywords: b3lyp d3bj def2-TZVPP def2/J RIJCOSX TightSCF defgrid3 CPCM(Acetonitrile)
formula: C4H4F6NiO6
InChI: InChI=1/2C2F3O2.Ni.2H2O/c2*3-2(4,5)1(6)7;;;/h;;;2*1H2/q-2;-1;+3;;/rC4H4F6NiO6/c5-3(6,7)1(12)15-11(13,14)16-2(17-11)4(8,9)10/h13-14H2
21 atoms
O  1.274528 0.927598 7.926137
O  3.806469 5.283156 7.360432
C  3.116322 6.100842 6.689516
O  2.911676 2.479685 8.233639
O  2.014238 5.786741 6.158047
C  2.332127 1.364316 8.417594
C  3.062401 0.400336 9.401845
C  3.630837 7.543997 6.483438
F  3.436198 -0.735175 8.755836
F  2.236242 0.035023 10.41452
F  4.170679 0.935569 9.954762
F  2.69048 8.446165 6.850182
F  4.74695 7.795118 7.194766
F  3.915729 7.75642 5.174252
O  0.498013 3.068484 6.669476
H  0.23083 2.990215 5.738784
H  0.61493 2.13609 7.036487
O  3.24925 3.149221 5.302289
H  3.082568 2.197049 5.187781
H  4.215888 3.229143 5.385767
Ni 2.313283 3.869727 6.958605
elementType: O C F H Ni
totalener: -2713.72658105427172 hartree
nucrepener: 1823.38464017424644 hartree
electener: -4537.06983358406615 hartree
oneelecener: -7396.55788232483792 hartree
twoeener: 2859.48804874077132 hartree
cpcmener: -0.04138557821077 hartree
kineticenergy: 2706.91769895170091 hartree
exchangeener: -154.421797227468 hartree
correlationener: -7.174559909974 hartree
xcener: -161.596357137442 hartree
s2: 2.003081
energy: -8161.2810 -975.8857 -851.3294 -851.2529 -851.2053 -672.9565 -672.9485 -672.9459 -672.7959 -672.7820 -672.7810 -522.0880 -521.5311 -521.1360 -521.0887 -521.0657 -520.6626 -284.2160 -283.9516 -281.1446 -280.9757 -112.5798 -74.3339 -74.2193 -74.0850 -36.1122 -35.9242 -33.8109 -33.7690 -33.6277 -33.5869 -30.3032 -29.8755 -28.9885 -28.3837 -27.6010 -27.5795 -20.6155 -20.3137 -17.7036 -17.5204 -16.6240 -16.5981 -16.4395 -16.4267 -15.7106 -15.4509 -14.8386 -14.4871 -13.6570 -13.6283 -13.4725 -13.3195 -13.2048 -13.1932 -13.0889 -12.8286 -12.7917 -12.6855 -12.6006 -12.2438 -12.1712 -12.1043 -12.0535 -11.8647 -11.7201 -11.5705 -11.4400 -11.0679 -10.6640 -10.1626 -10.0274 -9.9312 -9.5664 -9.1222 -8.8769 -8.7661 -8.6194 -8.3389 -7.7615 -1.0850 -0.7321 -0.1008 1.1265 1.5567 2.4051 2.8207 2.9053 2.9573 3.1656 3.6329 electronvolt
energy: -8161.2564 -974.6469 -850.2916 -850.2277 -850.2087 -672.9553 -672.9481 -672.9453 -672.7961 -672.7811 -672.7806 -522.0330 -521.4827 -521.0870 -521.0427 -521.0159 -520.6624 -284.2162 -283.9479 -281.1476 -280.9776 -109.9129 -71.4921 -71.3761 -71.3135 -36.1109 -35.9228 -33.8090 -33.7680 -33.6272 -33.5853 -30.2225 -29.8324 -28.8824 -28.2840 -27.5267 -27.4987 -20.5996 -20.2969 -17.6820 -17.4950 -16.6235 -16.5922 -16.4374 -16.4201 -15.6666 -15.4054 -14.7299 -14.4222 -13.5347 -13.4042 -13.3612 -13.1922 -13.1357 -13.0667 -12.9884 -12.7090 -12.5997 -12.4964 -12.3002 -12.2338 -12.1017 -12.0662 -11.9864 -11.8336 -11.7182 -11.5693 -10.6340 -10.2988 -9.5426 -9.3901 -9.2379 -9.0496 -8.8587 -8.7632 -8.6614 -8.2893 -8.2044 -2.9125 -2.1820 -1.0394 -0.7007 0.0234 1.2180 1.6166 2.4212 2.8575 2.9495 3.0082 electronvolt
chargesum: 0.0000000
charge: -0.450428 -0.445973 0.341089 -0.460576 -0.446591 0.301843 0.516456 0.503786 -0.185493 -0.183743 -0.178613 -0.175172 -0.171002 -0.177660 -0.419985 0.265890 0.258885 -0.359580 0.268281 0.269159 0.929425
charge: 0.086626 0.112069 -0.510661 0.124785 0.108498 -0.512079 -0.597153 -0.600583 0.172656 0.175227 0.186003 0.186141 0.195507 0.182386 0.403870 -0.060886 -0.142070 0.446121 -0.043006 -0.042334 0.128882
qa: -0.4504 -0.4460 0.3411 -0.4606 -0.4466 0.3018 0.5165 0.5038 -0.1855 -0.1837 -0.1786 -0.1752 -0.1710 -0.1777 -0.4200 0.2659 0.2589 -0.3596 0.2683 0.2692 0.9294
va: 2.0511 2.0116 4.0592 1.9920 2.0227 4.2355 4.4312 4.4650 1.1087 1.1126 1.1257 1.1269 1.1375 1.1222 2.1243 0.9912 1.0611 2.1766 0.9849 0.9881 3.3219
dispersion: -0.033068545 hartree
energy: -2713.759649598866 hartree
dipole: -5.578225846 5.415010921 -0.163214925 -5.953041823 4.997854310 -0.955187513 -8.253113146 5.820879634 -2.432233512
dipolemethod: SCF
magnitude: 2.618163890 au
magnitude: 6.654843738 debye
