program: Orca
programVersion: 6.0.0
elementType: O O C O O C C C F F F F F F Ni C N C N C N C H H H C H H H C H H H
charge: 0
multiplicity: 3
keywords: TPSS D3BJ TightOpt Freq def2-TZVPP def2/J RIJCOSX TightSCF defgrid3 CPCM(Acetonitrile)
frequency: 0.00 0.00 0.00 0.00 0.00 0.00 17.81 19.60 20.15 23.36 26.64 27.13 30.37 31.34 33.86 36.35 48.87 50.37 51.14 73.08 85.24 92.64 121.23 137.43 145.78 157.32 169.33 173.62 183.23 195.85 208.11 211.26 238.30 261.64 270.70 273.09 278.39 289.14 296.51 387.47 397.05 401.27 403.62 406.12 408.78 414.12 417.27 423.69 469.16 492.91 495.54 569.80 582.75 691.35 698.67 761.61 769.10 800.64 825.58 936.65 938.59 941.74 1038.54 1039.11 1039.63 1040.05 1040.18 1040.47 1040.90 1056.66 1083.56 1098.86 1145.13 1157.93 1343.00 1382.44 1382.79 1383.71 1428.94 1435.78 1435.94 1436.46 1436.97 1437.49 1437.54 1585.39 1665.66 2324.87 2327.07 2328.92 3020.07 3020.28 3020.54 3097.33 3098.08 3098.16 3098.60 3098.68 3098.89
frequency: 17.81 19.60 20.15 23.36 26.64 27.13 30.37 31.34 33.86 36.35 48.87 50.37 51.14 73.08 85.24 92.64 121.23 137.43 145.78 157.32 169.33 173.62 183.23 195.85 208.11 211.26 238.30 261.64 270.70 273.09 278.39 289.14 296.51 387.47 397.05 401.27 403.62 406.12 408.78 414.12 417.27 423.69 469.16 492.91 495.54 569.80 582.75 691.35 698.67 761.61 769.10 800.64 825.58 936.65 938.59 941.74 1038.54 1039.11 1039.63 1040.05 1040.18 1040.47 1040.90 1056.66 1083.56 1098.86 1145.13 1157.93 1343.00 1382.44 1382.79 1383.71 1428.94 1435.78 1435.94 1436.46 1436.97 1437.49 1437.54 1585.39 1665.66 2324.87 2327.07 2328.92 3020.07 3020.28 3020.54 3097.33 3098.08 3098.16 3098.60 3098.68 3098.89
formula: C10H9F6N3NiO4
InChI: InChI=1/2C2F3O2.3C2H3N.Ni/c2*3-2(4,5)1(6)7;3*1-2-3;/h;;3*1H3;/q;-1;;;;+1/rC8H9F3N3NiO2.C2F3O2/c1-4-12-15(13-5-2,14-6-3)17-7(16)8(9,10)11;3-2(4,5)1(6)7/h1-3H3;
33 atoms
O  0.872589 1.797615 9.714651
O  3.055978 6.081235 8.411587
C  2.598202 6.6264 7.37355
O  2.694334 3.105061 9.280978
O  1.87554 6.038539 6.52383
C  2.016217 2.216206 9.897607
C  2.853796 1.594224 11.067039
C  2.924222 8.116418 7.102955
F  3.97092 0.969093 10.598874
F  2.15757 0.677669 11.778256
F  3.272444 2.545575 11.94717
F  1.788559 8.861976 7.111279
F  3.761828 8.639935 8.022005
F  3.501557 8.27231 5.885007
Ni 2.050504 4.267871 7.765953
C  -0.471649 5.259861 9.406872
N  0.436605 4.894667 8.795075
C  4.702818 3.525633 6.177239
N  3.736152 3.792731 6.749257
C  0.364414 2.236457 6.03675
N  0.980462 2.971936 6.679101
C  -0.409617 1.305852 5.23961
H  -1.254257 1.830246 4.784738
H  0.223836 0.884035 4.454767
H  -0.781369 0.502161 5.881075
C  -1.611305 5.709717 10.181031
H  -2.065231 4.853663 10.687671
H  -1.280592 6.440842 10.923525
H  -2.345019 6.171665 9.515111
C  5.91725 3.19211 5.459472
H  6.384223 2.318352 5.921906
H  5.674056 2.968268 4.417328
H  6.607047 4.039386 5.499826
totalener: -2959.99491899689247 hartree
nucrepener: 2722.32091692456606 hartree
electener: -5682.26223247560938 hartree
oneelecener: -9523.04439686558180 hartree
twoeener: 3840.78216438997242 hartree
cpcmener: -0.05360344584901 hartree
kineticenergy: 2951.99749915799021 hartree
exchangeener: -231.598689099341 hartree
correlationener: -7.298724648805 hartree
xcener: -238.897413748145 hartree
s2: 2.003431
dispersion: -0.041048274 hartree
s2: 2.003461
dispersion: -0.041046216 hartree
s2: 2.003670
dispersion: -0.041122363 hartree
s2: 2.003756
dispersion: -0.041176514 hartree
s2: 2.003850
dispersion: -0.041253773 hartree
s2: 2.003925
dispersion: -0.041363674 hartree
s2: 2.003978
dispersion: -0.041490705 hartree
s2: 2.004082
dispersion: -0.041742817 hartree
s2: 2.004064
dispersion: -0.041978586 hartree
dispersion: -0.041855898 hartree
s2: 2.004092
dispersion: -0.041760848 hartree
s2: 2.004091
dispersion: -0.041715614 hartree
s2: 2.004095
dispersion: -0.041643560 hartree
s2: 2.004116
dispersion: -0.041588376 hartree
s2: 2.004148
dispersion: -0.041598021 hartree
s2: 2.004190
dispersion: -0.041670797 hartree
s2: 2.004242
dispersion: -0.041806654 hartree
s2: 2.004308
dispersion: -0.041998563 hartree
s2: 2.004324
dispersion: -0.042085075 hartree
s2: 2.004290
dispersion: -0.042101265 hartree
s2: 2.004281
dispersion: -0.042016541 hartree
s2: 2.004256
dispersion: -0.041932923 hartree
s2: 2.004261
dispersion: -0.041855436 hartree
dispersion: -0.041827631 hartree
s2: 2.004260
dispersion: -0.041816617 hartree
s2: 2.004263
dispersion: -0.041829767 hartree
s2: 2.004269
dispersion: -0.041861225 hartree
s2: 2.004282
dispersion: -0.041897723 hartree
s2: 2.004288
dispersion: -0.041905165 hartree
s2: 2.004305
dispersion: -0.041925817 hartree
s2: 2.004309
dispersion: -0.041930414 hartree
s2: 2.004317
dispersion: -0.041937045 hartree
dispersion: -0.041935639 hartree
s2: 2.004316
dispersion: -0.041929840 hartree
s2: 2.004313
dispersion: -0.041925751 hartree
s2: 2.004307
dispersion: -0.041921111 hartree
dispersion: -0.041921461 hartree
s2: 2.004304
dispersion: -0.041925468 hartree
dispersion: -0.041928989 hartree
dispersion: -0.041933011 hartree
s2: 2.004303
dispersion: -0.041935335 hartree
dispersion: -0.041935975 hartree
dispersion: -0.041934918 hartree
dispersion: -0.041933229 hartree
dispersion: -0.041932300 hartree
dispersion: -0.041931595 hartree
s2: 2.004306
dispersion: -0.041931318 hartree
dispersion: -0.041931356 hartree
dispersion: -0.041931592 hartree
dispersion: -0.041931486 hartree
dispersion: -0.041931439 hartree
dispersion: -0.041931084 hartree
dispersion: -0.041930044 hartree
dispersion: -0.041929144 hartree
dispersion: -0.041928570 hartree
dispersion: -0.041928125 hartree
dispersion: -0.041927938 hartree
dispersion: -0.041927763 hartree
dispersion: -0.041927568 hartree
dispersion: -0.041927298 hartree
dispersion: -0.041927012 hartree
dispersion: -0.041926775 hartree
dispersion: -0.041926472 hartree
dispersion: -0.041926312 hartree
dispersion: -0.041926142 hartree
dispersion: -0.041926113 hartree
dispersion: -0.041926110 hartree
dispersion: -0.041926205 hartree
dispersion: -0.041926139 hartree
dispersion: -0.041926017 hartree
dispersion: -0.041925665 hartree
dispersion: -0.041925689 hartree
dispersion: -0.041925750 hartree
dispersion: -0.041925828 hartree
dispersion: -0.041925947 hartree
dispersion: -0.041925799 hartree
dispersion: -0.041924837 hartree
dispersion: -0.041925109 hartree
dispersion: -0.041925945 hartree
elementType: O C F Ni N H
energy: -8136.4097 -964.1449 -839.9659 -839.9513 -839.9118 -665.3154 -665.3003 -665.2981 -665.0556 -665.0391 -665.0377 -514.1726 -514.1325 -513.8310 -513.2544 -384.6788 -384.6426 -384.6402 -278.6211 -278.2130 -275.4158 -274.9488 -273.7601 -273.7597 -273.7431 -272.9778 -272.9749 -272.9651 -107.7714 -69.8990 -69.8915 -69.7585 -33.6730 -33.3671 -31.4608 -31.4173 -31.1667 -31.1262 -27.9077 -27.1349 -25.4091 -25.0415 -23.9962 -23.9325 -23.9087 -19.7489 -19.7340 -19.7276 -18.6823 -18.2074 -15.8449 -15.4471 -14.8380 -14.8043 -14.5412 -14.5054 -13.5450 -13.1595 -13.1378 -12.7649 -12.5722 -12.0062 -11.7045 -11.6945 -11.5851 -11.5606 -11.5160 -11.5117 -11.5000 -11.4708 -11.4467 -11.3603 -11.3491 -11.2489 -11.2175 -11.1124 -10.8861 -10.8252 -10.6538 -10.4244 -10.3127 -10.2096 -10.1742 -9.9128 -9.9004 -9.6628 -9.3916 -9.1178 -9.0323 -8.9778 -8.8949 -8.6880 -8.5577 -8.0685 -7.6020 -7.4367 -7.2790 -7.1218 -7.0119 -6.6524 -6.2999 -6.1369 -5.8424 -1.4432 -0.9514 -0.9053 -0.8720 -0.7438 -0.5482 -0.5267 -0.3380 0.2760 0.7604 0.9297 electronvolt
energy: -8136.3960 -963.2238 -839.2085 -839.1913 -839.1797 -665.3138 -665.2995 -665.2974 -665.0530 -665.0390 -665.0377 -514.1055 -514.0670 -513.7572 -513.2541 -384.6309 -384.5934 -384.5921 -278.6178 -278.2047 -275.4209 -274.9518 -273.7599 -273.7584 -273.7419 -272.9759 -272.9731 -272.9632 -105.6121 -67.7399 -67.7161 -67.6727 -33.6708 -33.3644 -31.4582 -31.4160 -31.1635 -31.1259 -27.8155 -27.0810 -25.2924 -24.9759 -23.9521 -23.8897 -23.8646 -19.7425 -19.7275 -19.7208 -18.6613 -18.1843 -15.8228 -15.4190 -14.8363 -14.7982 -14.5380 -14.4985 -13.4461 -13.1099 -13.0722 -12.7060 -12.5062 -11.8622 -11.6650 -11.6020 -11.5558 -11.5198 -11.5086 -11.5005 -11.4844 -11.4708 -11.3285 -11.3073 -11.2457 -11.2047 -11.0681 -10.9630 -10.8222 -10.7031 -10.6229 -10.4165 -10.2747 -10.1925 -10.1535 -9.9023 -9.8912 -9.6613 -9.2890 -9.0604 -8.9506 -8.8934 -8.8355 -8.6490 -7.7904 -7.4668 -7.4458 -7.2278 -7.0560 -6.4203 -6.4056 -6.1608 -6.0881 -3.5295 -3.2516 -1.4226 -0.9148 -0.8658 -0.8125 -0.7070 -0.5077 -0.4780 -0.3010 0.2819 electronvolt
chargesum: -0.0000000
charge: -0.448558 -0.429883 0.312858 -0.488697 -0.442748 0.270199 0.403562 0.379528 -0.166541 -0.159647 -0.165119 -0.155346 -0.148666 -0.153878 0.616036 -0.126901 0.099206 -0.129149 0.097993 -0.145121 0.013309 -0.020167 0.114857 0.114848 0.114437 -0.024833 0.114525 0.115475 0.115049 -0.021752 0.115526 0.114896 0.114704
charge: 0.023140 0.128638 -0.555478 0.129797 0.123754 -0.579325 -0.621592 -0.627209 0.168021 0.183083 0.169411 0.184951 0.197927 0.187161 -0.288514 -0.041525 0.220472 -0.041594 0.216384 -0.042139 0.218315 0.050983 0.054773 0.054627 0.054846 0.051128 0.054836 0.054792 0.054628 0.051266 0.054930 0.054654 0.054859
qa: -0.4486 -0.4299 0.3129 -0.4887 -0.4427 0.2702 0.4036 0.3795 -0.1665 -0.1596 -0.1651 -0.1553 -0.1487 -0.1539 0.6160 -0.1269 0.0992 -0.1291 0.0980 -0.1451 0.0133 -0.0202 0.1149 0.1148 0.1144 -0.0248 0.1145 0.1155 0.1150 -0.0218 0.1155 0.1149 0.1147
va: 2.0338 2.0325 4.1048 1.9745 2.0320 4.2810 4.5205 4.5700 1.1296 1.1515 1.1312 1.1517 1.1676 1.1545 3.7268 3.7933 3.1500 3.7910 3.1210 3.8426 3.0976 3.9098 1.0038 1.0038 1.0045 3.9055 1.0046 1.0036 1.0036 3.9079 1.0038 1.0037 1.0039
dispersion: -0.041926035 hartree
energy: -2960.054290948834 hartree
dipole: -12.631238837 10.843148098 -1.788090740 -11.954505742 10.777811254 -1.176694488 -15.609707180 11.786294206 -3.823412973
dipolemethod: SCF
magnitude: 4.381822130 au
magnitude: 11.137706726 debye
temp: 298.15 k
press: 1.00 atm
zeropoint: 0.19172373 hartree
thermalvibcorrection: 0.02785081 hartree
thermalrotcorrection: 0.00141627 hartree
thermaltrasncorrection: 0.00141627 hartree
thermaltotal: -2959.83188387 hartree
thermalcorr: 0.03068335 hartree
nonthermalcorr: 0.19172373 hartree
totalcorr: 0.22240708 hartree
thermalcorrenthalpy: 0.00094421 hartree
totalenthalpy: -2959.83093966 hartree
vibrat: 0.05355305 hartree
rotat: 0.01695792 hartree
transl: 0.02086226 hartree
total: 0.09241052 hartree
totalentropycorr: -0.09241052 hartree
gibbsenthalpy: -2959.92335018 hartree
gibbsminuselec: 0.13094077 hartree
