program: Orca
programVersion: 6.0.0
elementType: O O C O O C C C F F F F F F O H H Ni O H H O H H C N C H H H
charge: 0
multiplicity: 3
keywords: TPSS D3BJ TightOpt Freq def2-TZVPP def2/J RIJCOSX TightSCF defgrid3 CPCM(Acetonitrile)
frequency: 0.00 0.00 0.00 0.00 0.00 0.00 13.21 14.24 15.11 16.09 33.90 38.03 39.33 41.14 54.44 61.04 95.39 103.18 123.43 124.71 130.47 142.22 157.60 168.25 170.23 199.92 220.69 222.93 229.82 233.76 263.10 267.57 287.53 303.19 310.67 331.87 343.80 401.08 403.72 421.71 424.47 434.02 449.48 457.03 462.42 494.21 494.61 514.89 582.00 583.20 593.29 618.71 632.82 691.96 693.82 767.13 767.34 797.42 802.27 938.64 951.77 974.56 1037.35 1039.42 1048.87 1049.11 1093.97 1094.08 1149.60 1153.17 1380.96 1383.37 1384.18 1435.61 1436.73 1590.01 1597.69 1603.40 1629.68 1639.61 2321.94 3020.13 3043.93 3046.23 3098.01 3098.37 3672.72 3717.32 3727.02 3754.03
frequency: 13.21 14.24 15.11 16.09 33.90 38.03 39.33 41.14 54.44 61.04 95.39 103.18 123.43 124.71 130.47 142.22 157.60 168.25 170.23 199.92 220.69 222.93 229.82 233.76 263.10 267.57 287.53 303.19 310.67 331.87 343.80 401.08 403.72 421.71 424.47 434.02 449.48 457.03 462.42 494.21 494.61 514.89 582.00 583.20 593.29 618.71 632.82 691.96 693.82 767.13 767.34 797.42 802.27 938.64 951.77 974.56 1037.35 1039.42 1048.87 1049.11 1093.97 1094.08 1149.60 1153.17 1380.96 1383.37 1384.18 1435.61 1436.73 1590.01 1597.69 1603.40 1629.68 1639.61 2321.94 3020.13 3043.93 3046.23 3098.01 3098.37 3672.72 3717.32 3727.02 3754.03
formula: C6H9F6NNiO7
InChI: InChI=1/2C2F3O2.C2H3N.Ni.3H2O/c2*3-2(4,5)1(6)7;1-2-3;;;;/h;;1H3;;3*1H2/q2*-1;;+2;;;/rC6H9F6NNiO7/c1-2-13-14(17,18,19,20-3(15)5(7,8)9)21-4(16)6(10,11)12/h17-19H2,1H3
30 atoms
O  1.002858 0.904665 7.774428
O  3.990444 6.527642 5.947181
C  2.748303 6.491781 5.85351
O  2.826793 2.167801 8.288576
O  1.923784 5.636098 6.290959
C  2.118499 1.118057 8.287516
C  2.79191 -0.058432 9.061447
C  2.048801 7.657296 5.086062
F  3.995033 -0.376449 8.513243
F  2.042589 -1.182123 9.063761
F  3.019368 0.278527 10.359161
F  1.161701 8.306359 5.886491
F  2.920758 8.578923 4.623062
F  1.353161 7.186104 4.016561
O  0.410869 3.347672 7.003294
H  0.139084 3.432086 6.075218
H  0.465537 2.362679 7.196092
Ni 2.424831 3.865187 7.201619
O  1.981445 4.788247 9.041666
H  1.253112 5.420068 8.918277
H  1.64267 4.126927 9.668495
O  4.411233 4.440447 7.505045
H  4.494211 4.741616 8.424895
H  4.423855 5.276505 6.947004
C  3.185172 2.485667 4.469171
N  2.914953 3.002283 5.46629
C  3.5245 1.835658 3.219022
H  3.427462 2.551605 2.398488
H  4.554381 1.471728 3.26654
H  2.846911 0.994002 3.051972
totalener: -2923.78586033963711 hartree
nucrepener: 2492.88154423187552 hartree
electener: -5416.62516333142594 hartree
oneelecener: -9020.59028901509009 hartree
twoeener: 3603.96512568366461 hartree
cpcmener: -0.04224124008759 hartree
kineticenergy: 2916.04547516901675 hartree
exchangeener: -222.346266744619 hartree
correlationener: -6.886789292242 hartree
xcener: -229.233056036861 hartree
s2: 2.003088
dispersion: -0.037671719 hartree
elementType: O C F H Ni N
s2: 2.003089
energy: -8136.0948 -963.7846 -839.6045 -839.5768 -839.5661 -665.2000 -665.1978 -665.1834 -665.1818 -665.1811 -665.1789 -515.0618 -514.4862 -514.4440 -514.0804 -514.0744 -513.7906 -513.7905 -384.6866 -278.4285 -278.4262 -275.3333 -275.3326 -273.7907 -272.9896 -107.4702 -69.6168 -69.5311 -69.5152 -33.5382 -33.5359 -31.3304 -31.3280 -31.2879 -31.2856 -27.6026 -27.5749 -26.7820 -26.1646 -26.1310 -25.4005 -25.3630 -23.9767 -19.7569 -18.4576 -18.4514 -15.7156 -15.7051 -14.7068 -14.7047 -14.6831 -14.6740 -14.0526 -13.6837 -13.5747 -13.3116 -12.9326 -12.7069 -11.9913 -11.6703 -11.5972 -11.5274 -11.5229 -11.4303 -11.4104 -11.3103 -11.2849 -11.1394 -10.9753 -10.8376 -10.7810 -10.4853 -10.4150 -10.3403 -10.3120 -10.2665 -10.1223 -10.0655 -9.7961 -9.7937 -9.4545 -9.0688 -8.9587 -8.6292 -8.3916 -8.3064 -7.6812 -7.4876 -7.3666 -7.1426 -6.8587 -6.8285 -6.6538 -6.5700 -6.0323 -5.7161 -1.2504 -1.2397 -0.7469 -0.6879 -0.0395 0.6638 1.1879 1.5852 1.9310 2.3116 2.4386 electronvolt
energy: -8136.0811 -962.8508 -838.8359 -838.8214 -838.8098 -665.1980 -665.1958 -665.1836 -665.1816 -665.1814 -665.1787 -515.0135 -514.4289 -514.3877 -514.0226 -514.0182 -513.7909 -513.7909 -384.6399 -278.4228 -278.4207 -275.3347 -275.3343 -273.7910 -272.9877 -105.2735 -67.4133 -67.3663 -67.3477 -33.5363 -33.5340 -31.3280 -31.3256 -31.2878 -31.2854 -27.5629 -27.5372 -26.7069 -26.0711 -26.0382 -25.3511 -25.3135 -23.9346 -19.7508 -18.4389 -18.4348 -15.6924 -15.6891 -14.7046 -14.7024 -14.6765 -14.6688 -14.0231 -13.6450 -13.5436 -13.2437 -12.8531 -12.6700 -11.9241 -11.5793 -11.5393 -11.5200 -11.4392 -11.4099 -11.3558 -11.2746 -11.2498 -11.0650 -10.9586 -10.7772 -10.5566 -10.4625 -10.3555 -10.3292 -10.2243 -10.1224 -10.0966 -10.0410 -9.7951 -9.7926 -9.1097 -9.0055 -8.6959 -8.4910 -8.1556 -7.6592 -7.5328 -7.4146 -7.2206 -7.0034 -6.8169 -6.0868 -5.9934 -5.9198 -3.1208 -3.0741 -1.2323 -1.2169 -0.7036 -0.6498 -0.0101 0.6719 1.2095 1.6163 1.9430 electronvolt
chargesum: -0.0000000
charge: -0.435383 -0.432580 0.271676 -0.455081 -0.454050 0.288409 0.408354 0.411468 -0.160019 -0.153620 -0.160094 -0.160044 -0.153534 -0.160377 -0.431425 0.263204 0.246833 0.712617 -0.376873 0.273565 0.273631 -0.437682 0.254172 0.251345 -0.130257 0.124722 -0.025008 0.115083 0.115830 0.115121
charge: 0.084515 0.084885 -0.550972 0.139084 0.139597 -0.551635 -0.624554 -0.624430 0.177576 0.190955 0.177493 0.177669 0.191049 0.177211 0.396463 -0.076234 -0.152871 -0.228571 0.434780 -0.058224 -0.057584 0.391991 -0.078460 -0.152316 -0.039109 0.215196 0.051495 0.054901 0.055115 0.054986
qa: -0.4354 -0.4326 0.2717 -0.4551 -0.4541 0.2884 0.4084 0.4115 -0.1600 -0.1536 -0.1601 -0.1600 -0.1535 -0.1604 -0.4314 0.2632 0.2468 0.7126 -0.3769 0.2736 0.2736 -0.4377 0.2542 0.2513 -0.1303 0.1247 -0.0250 0.1151 0.1158 0.1151
va: 2.0682 2.0621 4.2680 2.0153 2.0089 4.2370 4.5320 4.5326 1.1413 1.1607 1.1417 1.1417 1.1606 1.1413 2.0657 0.9902 1.0700 3.5507 2.1242 0.9796 0.9814 2.0695 0.9954 1.0699 3.8065 3.1284 3.9136 1.0036 1.0033 1.0038
dispersion: -0.037673142 hartree
energy: -2923.823531705667 hartree
dipole: 1.354693042 -1.798451876 -0.443758834 -3.687314213 3.072066860 -0.615247352 -7.470634510 6.120252276 -1.350382235
dipolemethod: SCF
magnitude: 1.548865193 au
magnitude: 3.936902451 debye
temp: 298.15 k
press: 1.00 atm
zeropoint: 0.17395155 hartree
thermalvibcorrection: 0.02501462 hartree
thermalrotcorrection: 0.00141627 hartree
thermaltrasncorrection: 0.00141627 hartree
thermaltotal: -2923.62173299 hartree
thermalcorr: 0.02784717 hartree
nonthermalcorr: 0.17395155 hartree
totalcorr: 0.20179871 hartree
thermalcorrenthalpy: 0.00094421 hartree
totalenthalpy: -2923.62078878 hartree
vibrat: 0.04750362 hartree
rotat: 0.01664820 hartree
transl: 0.02076132 hartree
total: 0.08595042 hartree
totalentropycorr: -0.08595042 hartree
gibbsenthalpy: -2923.70673921 hartree
gibbsminuselec: 0.11679250 hartree
