program: Orca
programVersion: 6.0.0
elementType: O O C O O C C C F F F F F F O H H O H H O H H Ni
charge: 0
multiplicity: 3
keywords: TPSS D3BJ TightOpt Freq def2-TZVPP def2/J RIJCOSX TightSCF defgrid3 CPCM(Acetonitrile)
frequency: 0.00 0.00 0.00 0.00 0.00 0.00 8.37 16.73 18.51 35.68 47.40 49.72 56.28 96.51 105.04 110.78 114.60 132.11 144.12 160.43 170.12 220.17 227.45 240.90 258.50 264.86 293.73 316.44 332.67 358.90 382.67 425.37 429.83 435.20 447.49 467.77 478.24 493.92 494.44 558.44 585.85 589.00 625.56 645.57 654.11 694.09 696.42 766.10 768.18 803.22 808.51 943.33 980.01 1052.78 1052.92 1097.55 1099.11 1148.74 1152.77 1384.73 1389.20 1567.01 1572.91 1605.24 1631.63 1640.96 2987.47 3043.38 3660.01 3724.55 3725.24 3737.12
frequency: 8.37 16.73 18.51 35.68 47.40 49.72 56.28 96.51 105.04 110.78 114.60 132.11 144.12 160.43 170.12 220.17 227.45 240.90 258.50 264.86 293.73 316.44 332.67 358.90 382.67 425.37 429.83 435.20 447.49 467.77 478.24 493.92 494.44 558.44 585.85 589.00 625.56 645.57 654.11 694.09 696.42 766.10 768.18 803.22 808.51 943.33 980.01 1052.78 1052.92 1097.55 1099.11 1148.74 1152.77 1384.73 1389.20 1567.01 1572.91 1605.24 1631.63 1640.96 2987.47 3043.38 3660.01 3724.55 3725.24 3737.12
formula: C4H6F6NiO7
InChI: InChI=1/2C2F3O2.Ni.3H2O/c2*3-2(4,5)1(6)7;;;;/h;;;3*1H2/q2*-1;+2;;;/rC4H6F6NiO7/c5-3(6,7)1(12)17-11(14,15,16)18-2(13)4(8,9)10/h14-16H2
24 atoms
O  1.026386 0.880263 7.991089
O  3.762823 6.761853 6.553427
C  2.681393 6.450985 6.023317
O  2.877352 2.165463 8.321571
O  1.990871 5.391201 6.14686
C  2.178259 1.112244 8.408272
C  2.867487 -0.076598 9.146776
C  2.021758 7.481715 5.056387
F  2.990145 -1.144952 8.315957
F  2.120133 -0.476371 10.208365
F  4.100856 0.218517 9.609697
F  0.81814 7.891136 5.538034
F  2.780504 8.582943 4.87627
F  1.801135 6.934329 3.83339
O  0.480322 3.224115 6.998374
H  0.275112 3.26126 6.0501
H  0.515718 2.252902 7.26669
O  1.677005 4.801499 9.109968
H  2.079775 5.679309 9.229385
H  0.723419 4.970387 9.01144
O  4.310521 4.420783 7.575517
H  4.667355 4.354359 8.476044
H  4.297383 5.392411 7.317899
Ni 2.361831 3.881858 7.415378
totalener: -2790.92070575931757 hartree
nucrepener: 2005.74459496309737 hartree
electener: -4796.62701939815452 hartree
oneelecener: -7866.48918348402822 hartree
twoeener: 3069.86216408587416 hartree
cpcmener: -0.03828132426026 hartree
kineticenergy: 2783.82114487713807 hartree
exchangeener: -204.189272828961 hartree
correlationener: -6.166908504992 hartree
xcener: -210.356181333953 hartree
s2: 2.002208
dispersion: -0.028774303 hartree
s2: 2.002221
dispersion: -0.028828589 hartree
s2: 2.002235
dispersion: -0.028989625 hartree
s2: 2.002230
dispersion: -0.029064167 hartree
s2: 2.002227
dispersion: -0.029055255 hartree
s2: 2.002220
dispersion: -0.028892714 hartree
s2: 2.002219
dispersion: -0.028925243 hartree
s2: 2.002216
dispersion: -0.028920060 hartree
s2: 2.002212
dispersion: -0.028878170 hartree
s2: 2.002209
dispersion: -0.028838094 hartree
dispersion: -0.028833107 hartree
s2: 2.002210
dispersion: -0.028837257 hartree
dispersion: -0.028849608 hartree
s2: 2.002213
dispersion: -0.028855316 hartree
dispersion: -0.028855621 hartree
dispersion: -0.028852946 hartree
dispersion: -0.028849696 hartree
dispersion: -0.028847163 hartree
dispersion: -0.028846543 hartree
dispersion: -0.028847246 hartree
dispersion: -0.028848273 hartree
dispersion: -0.028848816 hartree
elementType: O C F H Ni
energy: -8136.4374 -964.1077 -839.9930 -839.8763 -839.8524 -665.2660 -665.2473 -665.2455 -665.2454 -665.2323 -665.2316 -515.4334 -514.8059 -514.7436 -514.3286 -514.3259 -513.9692 -513.9129 -278.5262 -278.5100 -275.5116 -275.4946 -107.8177 -70.0484 -69.8580 -69.8168 -33.6149 -33.5979 -31.4047 -31.3840 -31.3593 -31.3455 -27.8002 -27.7591 -27.1125 -26.4478 -26.3891 -25.5949 -25.5422 -18.5670 -18.5452 -15.8349 -15.8132 -14.7807 -14.7648 -14.7636 -14.7418 -14.3239 -14.0366 -13.8956 -13.2102 -12.9447 -12.1708 -11.8385 -11.6460 -11.5114 -11.4703 -11.3755 -11.3536 -11.1881 -11.1053 -11.0693 -10.6306 -10.5655 -10.5232 -10.3957 -10.3788 -10.2125 -10.1770 -9.8557 -9.8397 -9.5361 -9.2315 -8.6995 -8.6190 -8.0266 -7.7473 -7.5775 -7.4233 -7.1986 -7.0471 -6.9632 -6.8232 -6.7667 -5.8267 -1.4381 -1.3438 -0.3817 0.7248 0.9670 2.0584 2.1791 2.3239 2.4786 2.5456 2.6128 electronvolt
energy: -8136.4227 -963.1913 -839.2290 -839.1355 -839.1176 -665.2641 -665.2476 -665.2457 -665.2451 -665.2316 -665.2302 -515.3703 -514.7514 -514.6936 -514.2782 -514.2731 -513.9683 -513.9128 -278.5217 -278.5051 -275.5128 -275.4956 -105.6451 -67.8901 -67.6895 -67.6692 -33.6131 -33.5962 -31.4025 -31.3834 -31.3591 -31.3436 -27.7610 -27.7229 -27.0102 -26.3569 -26.3061 -25.5474 -25.4964 -18.5502 -18.5297 -15.8138 -15.7953 -14.7785 -14.7613 -14.7571 -14.7372 -14.2846 -13.9945 -13.8672 -13.1206 -12.9066 -12.0973 -11.7837 -11.5069 -11.5001 -11.3813 -11.3560 -11.2928 -11.0921 -11.0275 -10.7795 -10.5784 -10.5131 -10.4544 -10.3810 -10.3639 -10.1945 -10.1632 -9.8548 -9.8390 -9.0951 -8.9655 -8.5025 -7.9519 -7.8010 -7.6308 -7.4532 -7.2165 -6.9761 -6.4265 -6.2133 -6.1850 -4.1373 -3.1944 -1.4042 -1.3220 -0.2647 0.8228 1.0218 2.1148 2.2571 2.3494 2.5033 electronvolt
chargesum: 0.0000000
charge: -0.426930 -0.421086 0.294945 -0.413059 -0.424765 0.270454 0.420557 0.417976 -0.158266 -0.157903 -0.153068 -0.157793 -0.150733 -0.156558 -0.417027 0.270906 0.257209 -0.383345 0.280855 0.278043 -0.396539 0.271444 0.254416 0.800266
charge: 0.094841 0.095531 -0.539249 0.141931 0.136063 -0.538677 -0.625309 -0.626303 0.181183 0.181774 0.192675 0.180122 0.194960 0.182367 0.405827 -0.068386 -0.151828 0.452371 -0.046016 -0.047603 0.412728 -0.065618 -0.146356 0.002971
qa: -0.4269 -0.4211 0.2949 -0.4131 -0.4248 0.2705 0.4206 0.4180 -0.1583 -0.1579 -0.1531 -0.1578 -0.1507 -0.1566 -0.4170 0.2709 0.2572 -0.3833 0.2809 0.2780 -0.3965 0.2714 0.2544 0.8003
va: 2.0826 2.0852 4.2276 2.0515 2.0490 4.2607 4.5162 4.5297 1.1453 1.1460 1.1607 1.1450 1.1653 1.1477 2.1009 0.9847 1.0655 2.1465 0.9800 0.9791 2.1319 0.9812 1.0622 3.3923
dispersion: -0.028849500 hartree
energy: -2790.955608248989 hartree
dipole: -1.899847581 1.375318723 -0.524528858 3.511761725 -2.091500691 1.420261034 4.396090255 -3.402310397 0.993779857
dipolemethod: SCF
magnitude: 1.811041229 au
magnitude: 4.603300973 debye
temp: 298.15 k
press: 1.00 atm
zeropoint: 0.12809380 hartree
thermalvibcorrection: 0.01974240 hartree
thermalrotcorrection: 0.00141627 hartree
thermaltrasncorrection: 0.00141627 hartree
thermaltotal: -2790.80493951 hartree
thermalcorr: 0.02257494 hartree
nonthermalcorr: 0.12809380 hartree
totalcorr: 0.15066874 hartree
thermalcorrenthalpy: 0.00094421 hartree
totalenthalpy: -2790.80399530 hartree
vibrat: 0.03716606 hartree
rotat: 0.01628885 hartree
transl: 0.02059932 hartree
total: 0.07509152 hartree
totalentropycorr: -0.07509152 hartree
gibbsenthalpy: -2790.87908682 hartree
gibbsminuselec: 0.07652143 hartree
